Deploy details
Your deploy failed due to an errorDeploy log
Initializing
Complete
Initializing
Complete
10:46:20 PM: Waiting for other deploys from your team to complete. Check the queue: https://app.netlify.com/teams/amoscardino/builds
10:50:57 PM: Build ready to start
10:51:12 PM: build-image version: 9a361c83c6a43010ba0aa3ea38214accc0223b2c (focal)
10:51:12 PM: buildbot version: 9a4374dc9e2c1cbd2a152e441d69a3a6d7e12511
10:51:13 PM: Fetching cached dependencies
10:51:13 PM: Starting to download cache of 219.1MB
10:51:14 PM: Finished downloading cache in 1.623s
10:51:14 PM: Starting to extract cache
10:51:19 PM: Finished extracting cache in 5.024s
10:51:19 PM: Finished fetching cache in 6.704s
10:51:19 PM: Starting to prepare the repo for build
10:51:20 PM: Preparing Git Reference pull/6/head
10:51:22 PM: Starting to install dependencies
10:51:22 PM: Started restoring cached mise cache
10:51:23 PM: Finished restoring cached mise cache
10:51:24 PM: mise python@3.13.2 install
10:51:24 PM: mise python@3.13.2 download cpython-3.13.2+20250212-x86_64-unknown-linux-gnu-install_only_stripped.tar.gz
10:51:24 PM: mise python@3.13.2 extract cpython-3.13.2+20250212-x86_64-unknown-linux-gnu-install_only_stripped.tar.gz
10:51:24 PM: mise python@3.13.2 python --version
10:51:24 PM: mise python@3.13.2 Python 3.13.2
10:51:24 PM: mise python@3.13.2 ✓ installed
10:51:24 PM: Python version set to 3.13
10:51:26 PM: Collecting pipenv
10:51:26 PM: Downloading pipenv-2024.4.1-py3-none-any.whl.metadata (17 kB)
10:51:26 PM: Collecting certifi (from pipenv)
10:51:26 PM: Downloading certifi-2025.1.31-py3-none-any.whl.metadata (2.5 kB)
10:51:26 PM: Collecting packaging>=22 (from pipenv)
10:51:26 PM: Downloading packaging-24.2-py3-none-any.whl.metadata (3.2 kB)
10:51:26 PM: Collecting setuptools>=67 (from pipenv)
10:51:26 PM: Downloading setuptools-76.0.0-py3-none-any.whl.metadata (6.7 kB)
10:51:26 PM: Collecting virtualenv>=20.24.2 (from pipenv)
10:51:26 PM: Downloading virtualenv-20.29.3-py3-none-any.whl.metadata (4.5 kB)
10:51:26 PM: Collecting distlib<1,>=0.3.7 (from virtualenv>=20.24.2->pipenv)
10:51:26 PM: Downloading distlib-0.3.9-py2.py3-none-any.whl.metadata (5.2 kB)
10:51:26 PM: Collecting filelock<4,>=3.12.2 (from virtualenv>=20.24.2->pipenv)
10:51:26 PM: Downloading filelock-3.17.0-py3-none-any.whl.metadata (2.9 kB)
10:51:26 PM: Collecting platformdirs<5,>=3.9.1 (from virtualenv>=20.24.2->pipenv)
10:51:26 PM: Downloading platformdirs-4.3.6-py3-none-any.whl.metadata (11 kB)
10:51:26 PM: Downloading pipenv-2024.4.1-py3-none-any.whl (3.0 MB)
10:51:27 PM: ━━━━━━━━━━━━━━━━━━━━━━━━━━━━━━━━━━━━━━━━ 3.0/3.0 MB 47.3 MB/s eta 0:00:00
10:51:27 PM: Downloading packaging-24.2-py3-none-any.whl (65 kB)
10:51:27 PM: Downloading setuptools-76.0.0-py3-none-any.whl (1.2 MB)
10:51:27 PM: ━━━━━━━━━━━━━━━━━━━━━━━━━━━━━━━━━━━━━━━━ 1.2/1.2 MB 61.8 MB/s eta 0:00:00
10:51:27 PM: Downloading virtualenv-20.29.3-py3-none-any.whl (4.3 MB)
10:51:27 PM: ━━━━━━━━━━━━━━━━━━━━━━━━━━━━━━━━━━━━━━━━ 4.3/4.3 MB 90.1 MB/s eta 0:00:00
10:51:27 PM: Downloading certifi-2025.1.31-py3-none-any.whl (166 kB)
10:51:27 PM: Downloading distlib-0.3.9-py2.py3-none-any.whl (468 kB)
10:51:27 PM: Downloading filelock-3.17.0-py3-none-any.whl (16 kB)
10:51:27 PM: Downloading platformdirs-4.3.6-py3-none-any.whl (18 kB)
10:51:27 PM: Installing collected packages: distlib, setuptools, platformdirs, packaging, filelock, certifi, virtualenv, pipenv
10:51:29 PM: Successfully installed certifi-2025.1.31 distlib-0.3.9 filelock-3.17.0 packaging-24.2 pipenv-2024.4.1 platformdirs-4.3.6 setuptools-76.0.0 virtualenv-20.29.3
10:51:29 PM: [notice] A new release of pip is available: 24.3.1 -> 25.0.1
10:51:29 PM: [notice] To update, run: pip install --upgrade pip
10:51:30 PM: Attempting Ruby version 2.7.1, read from environment
10:51:30 PM: Started restoring cached Ruby version
10:51:30 PM: Finished restoring cached Ruby version
10:51:30 PM: Using Ruby version 2.7.1
10:51:31 PM: Started restoring cached go cache
10:51:31 PM: Finished restoring cached go cache
10:51:31 PM: Installing Go version 1.14.4 (requested 1.14.4)
10:51:35 PM: go version go1.14.4 linux/amd64
10:51:36 PM: Using PHP version 8.0
10:51:38 PM: Started restoring cached Node.js version
10:51:41 PM: Finished restoring cached Node.js version
10:51:41 PM: v12.18.0 is already installed.
10:51:42 PM: Now using node v12.18.0 (npm v6.14.4)
10:51:42 PM: Started restoring cached build plugins
10:51:42 PM: Finished restoring cached build plugins
10:51:42 PM: Started restoring cached corepack dependencies
10:51:42 PM: Finished restoring cached corepack dependencies
10:51:42 PM: No npm workspaces detected
10:51:42 PM: Started restoring cached node modules
10:51:42 PM: Finished restoring cached node modules
10:51:42 PM: Installing npm packages using npm version 6.14.4
10:52:02 PM: npm WARN read-shrinkwrap This version of npm is compatible with lockfileVersion@1, but package-lock.json was generated for lockfileVersion@2. I'll try to do my best with it!
10:52:02 PM: > core-js@3.41.0 postinstall /opt/build/repo/node_modules/core-js
10:52:02 PM: > node -e "try{require('./postinstall')}catch(e){}"
10:52:03 PM: npm WARN @monaco-editor/loader@1.0.1 requires a peer of monaco-editor@>= 0.21.0 < 1 but none is installed. You must install peer dependencies yourself.
10:52:03 PM: npm WARN @monaco-editor/react@4.1.3 requires a peer of monaco-editor@^0.23.0 but none is installed. You must install peer dependencies yourself.
10:52:03 PM: npm WARN bootstrap@5.0.1 requires a peer of @popperjs/core@^2.9.2 but none is installed. You must install peer dependencies yourself.
10:52:03 PM: npm WARN tsutils@3.21.0 requires a peer of typescript@>=2.8.0 || >= 3.2.0-dev || >= 3.3.0-dev || >= 3.4.0-dev || >= 3.5.0-dev || >= 3.6.0-dev || >= 3.6.0-beta || >= 3.7.0-dev || >= 3.7.0-beta but none is installed. You must install peer dependencies yourself.
10:52:03 PM: npm WARN optional SKIPPING OPTIONAL DEPENDENCY: fsevents@2.3.3 (node_modules/fsevents):
10:52:03 PM: npm WARN notsup SKIPPING OPTIONAL DEPENDENCY: Unsupported platform for fsevents@2.3.3: wanted {"os":"darwin","arch":"any"} (current: {"os":"linux","arch":"x64"})
10:52:03 PM: added 380 packages from 247 contributors, removed 859 packages, updated 640 packages, moved 3 packages and audited 1493 packages in 20.583s
10:52:03 PM: 266 packages are looking for funding
10:52:03 PM: run `npm fund` for details
10:52:03 PM: found 8 vulnerabilities (1 moderate, 5 high, 2 critical)
10:52:03 PM: run `npm audit fix` to fix them, or `npm audit` for details
10:52:03 PM: npm packages installed
10:52:04 PM: Successfully installed dependencies
10:52:04 PM: Starting build script
10:52:05 PM: Detected 1 framework(s)
10:52:05 PM: "create-react-app" at version "5.0.1"
10:52:05 PM: Section completed: initializing
Building
Failed
Building
Failed
10:52:06 PM: Netlify Build
10:52:06 PM: ────────────────────────────────────────────────────────────────
10:52:06 PM:
10:52:06 PM: ❯ Version
10:52:06 PM: @netlify/build 29.59.2
10:52:06 PM:
10:52:06 PM: ❯ Flags
10:52:06 PM: accountId: 5acbd1aac6aed65624fd0909
10:52:06 PM: baseRelDir: true
10:52:06 PM: buildId: 67d0bd3b94d82f0008d91a2c
10:52:06 PM: deployId: 67d0bd3b94d82f0008d91a2e
10:52:06 PM:
10:52:06 PM: ❯ Current directory
10:52:06 PM: /opt/build/repo
10:52:06 PM:
10:52:06 PM: ❯ Config file
10:52:06 PM: No config file was defined: using default values.
10:52:06 PM:
10:52:06 PM: ❯ Context
10:52:06 PM: deploy-preview
10:52:06 PM:
10:52:06 PM: Build command from Netlify app
10:52:06 PM: ────────────────────────────────────────────────────────────────
10:52:06 PM:
10:52:06 PM: $ npm run build
10:52:07 PM: > sql-viewer@0.1.0 build /opt/build/repo
10:52:07 PM: > react-scripts build
10:52:08 PM: Creating an optimized production build...
10:52:16 PM: Failed during stage 'building site': Build script returned non-zero exit code: 2 (https://ntl.fyi/exit-code-2)
10:52:16 PM:
10:52:16 PM: Treating warnings as errors because process.env.CI = true.
10:52:16 PM: Most CI servers set it automatically.
10:52:16 PM:
10:52:16 PM: Failed to compile.
10:52:16 PM:
10:52:16 PM: Warning
10:52:16 PM: (2403:3) autoprefixer: Replace color-adjust to print-color-adjust. The color-adjust shorthand is currently deprecated.
10:52:16 PM: npm ERR! code ELIFECYCLE
10:52:16 PM: npm ERR! errno 1
10:52:16 PM: npm ERR! sql-viewer@0.1.0 build: `react-scripts build`
10:52:16 PM: npm ERR! Exit status 1
10:52:16 PM: npm ERR!
10:52:16 PM: npm ERR! Failed at the sql-viewer@0.1.0 build script.
10:52:16 PM: npm ERR! This is probably not a problem with npm. There is likely additional logging output above.
10:52:16 PM: npm ERR! A complete log of this run can be found in:
10:52:16 PM: npm ERR! /opt/buildhome/.npm/_logs/2025-03-11T22_52_16_275Z-debug.log
10:52:16 PM:
10:52:16 PM: "build.command" failed
10:52:16 PM: ────────────────────────────────────────────────────────────────
10:52:16 PM:
10:52:16 PM: Error message
10:52:16 PM: Command failed with exit code 1: npm run build (https://ntl.fyi/exit-code-1)
10:52:16 PM:
10:52:16 PM: Error location
10:52:16 PM: In Build command from Netlify app:
10:52:16 PM: npm run build
10:52:16 PM:
10:52:16 PM: Resolved config
10:52:16 PM: build:
10:52:16 PM: command: npm run build
10:52:16 PM: commandOrigin: ui
10:52:16 PM: environment:
10:52:16 PM: - REVIEW_ID
10:52:16 PM: publish: /opt/build/repo/build
10:52:16 PM: publishOrigin: ui
10:52:16 PM: Build failed due to a user error: Build script returned non-zero exit code: 2
10:52:16 PM: Failing build: Failed to build site
10:52:17 PM: Finished processing build request in 1m4.086s
Deploying
Skipped
Deploying
Skipped
There is no log for this section
Cleanup
Skipped
Cleanup
Skipped
There is no log for this section
Post-processing
Skipped
Post-processing
Skipped
There is no log for this section