Deploy details
Your deploy failed due to an errorDeploy log
Initializing
Complete
Initializing
Complete
4:27:29 PM: Build ready to start
4:27:42 PM: build-image version: 443b2adda37c1cfb0bd1ca7d048c000a6908b528 (focal)
4:27:42 PM: buildbot version: 8ac0440d49dc930265dfb56913dbfeb6619db205
4:27:42 PM: Fetching cached dependencies
4:27:42 PM: Failed to fetch cache, continuing with build
4:27:42 PM: Starting to prepare the repo for build
4:27:42 PM: No cached dependencies found. Cloning fresh repo
4:27:42 PM: git clone --filter=blob:none https://github.com/bigardone/elm-css-patterns
4:27:42 PM: Preparing Git Reference pull/10/head
4:27:44 PM: Starting to install dependencies
4:27:45 PM: mise python@3.13.1 install
4:27:45 PM: mise python@3.13.1 download cpython-3.13.1+20250106-x86_64-unknown-linux-gnu-install_only_stripped.tar.gz
4:27:45 PM: mise python@3.13.1 extract cpython-3.13.1+20250106-x86_64-unknown-linux-gnu-install_only_stripped.tar.gz
4:27:46 PM: mise python@3.13.1 python --version
4:27:46 PM: mise python@3.13.1 Python 3.13.1
4:27:46 PM: mise python@3.13.1 ✓ installed
4:27:46 PM: Python version set to 3.13
4:27:48 PM: Collecting pipenv
4:27:48 PM: Downloading pipenv-2024.4.0-py3-none-any.whl.metadata (19 kB)
4:27:48 PM: Collecting certifi (from pipenv)
4:27:48 PM: Downloading certifi-2024.12.14-py3-none-any.whl.metadata (2.3 kB)
4:27:48 PM: Collecting packaging>=22 (from pipenv)
4:27:48 PM: Downloading packaging-24.2-py3-none-any.whl.metadata (3.2 kB)
4:27:48 PM: Collecting setuptools>=67 (from pipenv)
4:27:48 PM: Downloading setuptools-75.7.0-py3-none-any.whl.metadata (6.7 kB)
4:27:48 PM: Collecting virtualenv>=20.24.2 (from pipenv)
4:27:48 PM: Downloading virtualenv-20.28.1-py3-none-any.whl.metadata (4.5 kB)
4:27:48 PM: Collecting distlib<1,>=0.3.7 (from virtualenv>=20.24.2->pipenv)
4:27:48 PM: Downloading distlib-0.3.9-py2.py3-none-any.whl.metadata (5.2 kB)
4:27:48 PM: Collecting filelock<4,>=3.12.2 (from virtualenv>=20.24.2->pipenv)
4:27:48 PM: Downloading filelock-3.16.1-py3-none-any.whl.metadata (2.9 kB)
4:27:48 PM: Collecting platformdirs<5,>=3.9.1 (from virtualenv>=20.24.2->pipenv)
4:27:48 PM: Downloading platformdirs-4.3.6-py3-none-any.whl.metadata (11 kB)
4:27:48 PM: Downloading pipenv-2024.4.0-py3-none-any.whl (3.0 MB)
4:27:49 PM: ━━━━━━━━━━━━━━━━━━━━━━━━━━━━━━━━━━━━━━━━ 3.0/3.0 MB 36.2 MB/s eta 0:00:00
4:27:49 PM: Downloading packaging-24.2-py3-none-any.whl (65 kB)
4:27:49 PM: Downloading setuptools-75.7.0-py3-none-any.whl (1.2 MB)
4:27:49 PM: ━━━━━━━━━━━━━━━━━━━━━━━━━━━━━━━━━━━━━━━━ 1.2/1.2 MB 36.4 MB/s eta 0:00:00
4:27:49 PM: Downloading virtualenv-20.28.1-py3-none-any.whl (4.3 MB)
4:27:49 PM: ━━━━━━━━━━━━━━━━━━━━━━━━━━━━━━━━━━━━━━━━ 4.3/4.3 MB 53.5 MB/s eta 0:00:00
4:27:49 PM: Downloading certifi-2024.12.14-py3-none-any.whl (164 kB)
4:27:49 PM: Downloading distlib-0.3.9-py2.py3-none-any.whl (468 kB)
4:27:49 PM: Downloading filelock-3.16.1-py3-none-any.whl (16 kB)
4:27:49 PM: Downloading platformdirs-4.3.6-py3-none-any.whl (18 kB)
4:27:49 PM: Installing collected packages: distlib, setuptools, platformdirs, packaging, filelock, certifi, virtualenv, pipenv
4:27:51 PM: Successfully installed certifi-2024.12.14 distlib-0.3.9 filelock-3.16.1 packaging-24.2 pipenv-2024.4.0 platformdirs-4.3.6 setuptools-75.7.0 virtualenv-20.28.1
4:27:52 PM: Attempting Ruby version 2.6.2, read from environment
4:27:52 PM: Required ruby-2.6.2 is not installed - installing.
4:27:52 PM: Searching for binary rubies, this might take some time.
4:27:52 PM: Found remote file https://rvm_io.global.ssl.fastly.net/binaries/ubuntu/20.04/x86_64/ruby-2.6.2.tar.bz2
4:27:52 PM: Checking requirements for ubuntu.
4:27:53 PM: Requirements installation successful.
4:27:53 PM: ruby-2.6.2 - #configure
4:27:53 PM: ruby-2.6.2 - #download
4:27:53 PM: ruby-2.6.2 - #validate archive
4:27:56 PM: ruby-2.6.2 - #extract
4:27:58 PM: ruby-2.6.2 - #validate binary
4:27:58 PM: ruby-2.6.2 - #setup
4:27:59 PM: ruby-2.6.2 - #gemset created /opt/buildhome/.rvm/gems/ruby-2.6.2@global
4:27:59 PM: ruby-2.6.2 - #importing gemset /opt/buildhome/.rvm/gemsets/global.gems........................................
4:27:59 PM: ruby-2.6.2 - #generating global wrappers........
4:27:59 PM: ruby-2.6.2 - #gemset created /opt/buildhome/.rvm/gems/ruby-2.6.2
4:27:59 PM: ruby-2.6.2 - #importing gemsetfile /opt/buildhome/.rvm/gemsets/default.gems evaluated to empty gem list
4:27:59 PM: ruby-2.6.2 - #generating default wrappers........
4:28:00 PM: Using /opt/buildhome/.rvm/gems/ruby-2.6.2
4:28:00 PM: Using Ruby version 2.6.2
4:28:00 PM: Started restoring cached go cache
4:28:00 PM: Finished restoring cached go cache
4:28:00 PM: Installing Go version 1.12 (requested 1.12)
4:28:05 PM: go version go1.12 linux/amd64
4:28:06 PM: Using PHP version 8.0
4:28:08 PM: Downloading and installing node v10.24.1...
4:28:08 PM: Downloading https://nodejs.org/dist/v10.24.1/node-v10.24.1-linux-x64.tar.xz...
4:28:08 PM: Computing checksum with sha256sum
4:28:08 PM: Checksums matched!
4:28:10 PM: Now using node v10.24.1 (npm v6.14.12)
4:28:10 PM: Started restoring cached build plugins
4:28:10 PM: Finished restoring cached build plugins
4:28:10 PM: Started restoring cached corepack dependencies
4:28:10 PM: Finished restoring cached corepack dependencies
4:28:10 PM: No npm workspaces detected
4:28:10 PM: Started restoring cached node modules
4:28:10 PM: Finished restoring cached node modules
4:28:10 PM: Installing npm packages using npm version 6.14.12
4:28:11 PM: npm WARN deprecated parcel-bundler@1.12.5: Parcel v1 is no longer maintained. Please migrate to v2, which is published under the 'parcel' package. See https://v2.parceljs.org/getting-started/migration for details.
4:28:13 PM: npm WARN deprecated core-js@2.6.12: core-js@<3.23.3 is no longer maintained and not recommended for usage due to the number of issues. Because of the V8 engine whims, feature detection in old core-js versions could cause a slowdown up to 100x even if nothing is polyfilled. Some versions have web compatibility issues. Please, upgrade your dependencies to the actual version of core-js.
4:28:15 PM: npm WARN deprecated rimraf@2.7.1: Rimraf versions prior to v4 are no longer supported
4:28:16 PM: npm WARN deprecated svgo@1.3.2: This SVGO version is no longer supported. Upgrade to v2.x.x.
4:28:17 PM: npm WARN deprecated rimraf@2.6.3: Rimraf versions prior to v4 are no longer supported
4:28:17 PM: npm WARN deprecated fsevents@1.2.13: Upgrade to fsevents v2 to mitigate potential security issues
4:28:17 PM: npm WARN deprecated glob@7.2.3: Glob versions prior to v9 are no longer supported
4:28:18 PM: npm WARN deprecated stable@0.1.8: Modern JS already guarantees Array#sort() is a stable sort, so this library is deprecated. See the compatibility table on MDN: https://developer.mozilla.org/en-US/docs/Web/JavaScript/Reference/Global_Objects/Array/sort#browser_compatibility
4:28:18 PM: npm WARN deprecated request@2.88.2: request has been deprecated, see https://github.com/request/request/issues/3142
4:28:18 PM: npm WARN deprecated source-map-resolve@0.5.3: See https://github.com/lydell/source-map-resolve#deprecated
4:28:19 PM: npm WARN deprecated inflight@1.0.6: This module is not supported, and leaks memory. Do not use it. Check out lru-cache if you want a good and tested way to coalesce async requests by a key value, which is much more comprehensive and powerful.
4:28:19 PM: npm WARN deprecated q@1.5.1: You or someone you depend on is using Q, the JavaScript Promise library that gave JavaScript developers strong feelings about promises. They can almost certainly migrate to the native JavaScript promise now. Thank you literally everyone for joining me in this bet against the odds. Be excellent to each other.
4:28:19 PM: npm WARN deprecated
4:28:19 PM: npm WARN deprecated (For a CapTP with native promises, see @endo/eventual-send and @endo/captp)
4:28:19 PM: npm WARN deprecated abab@2.0.6: Use your platform's native atob() and btoa() methods instead
npm WARN deprecated w3c-hr-time@1.0.2: Use your platform's native performance.now() and performance.timeOrigin.
npm WARN deprecated domexception@1.0.1: Use your platform's native DOMException instead
npm WARN deprecated request-promise-native@1.0.9: request-promise-native has been deprecated because it extends the now deprecated request package, see https://github.com/request/request/issues/3142
npm WARN deprecated w3c-hr-time@1.0.2: Use your platform's native performance.now() and performance.timeOrigin.
npm WARN deprecated domexception@1.0.1: Use your platform's native DOMException instead
npm WARN deprecated request-promise-native@1.0.9: request-promise-native has been deprecated because it extends the now deprecated request package, see https://github.com/request/request/issues/3142
4:28:19 PM: npm WARN deprecated uuid@3.4.0: Please upgrade to version 7 or higher. Older versions may use Math.random() in certain circumstances, which is known to be problematic. See https://v8.dev/blog/math-random for details.
4:28:19 PM: npm WARN deprecated har-validator@5.1.5: this library is no longer supported
4:28:20 PM: npm WARN deprecated source-map-url@0.4.1: See https://github.com/lydell/source-map-url#deprecated
4:28:20 PM: npm WARN deprecated resolve-url@0.2.1: https://github.com/lydell/resolve-url#deprecated
4:28:20 PM: npm WARN deprecated urix@0.1.0: Please see https://github.com/lydell/urix#deprecated
4:28:28 PM: > deasync@0.1.30 install /opt/build/repo/node_modules/deasync
4:28:28 PM: > node ./build.js
4:28:28 PM: `linux-x64-node-10` exists; testing
4:28:28 PM: Binary is fine; exiting
4:28:28 PM: > bufferutil@4.0.9 install /opt/build/repo/node_modules/bufferutil
4:28:28 PM: > node-gyp-build
4:28:29 PM: > utf-8-validate@5.0.10 install /opt/build/repo/node_modules/utf-8-validate
4:28:29 PM: > node-gyp-build
4:28:29 PM: > elm@0.19.1-6 install /opt/build/repo/node_modules/elm
4:28:29 PM: > node install.js
4:28:29 PM: > core-js@2.6.12 postinstall /opt/build/repo/node_modules/core-js
4:28:29 PM: > node -e "try{require('./postinstall')}catch(e){}"
4:28:29 PM: > es5-ext@0.10.64 postinstall /opt/build/repo/node_modules/es5-ext
4:28:29 PM: > node -e "try{require('./_postinstall')}catch(e){}" || exit 0
4:28:29 PM: > parcel-bundler@1.12.5 postinstall /opt/build/repo/node_modules/parcel-bundler
4:28:29 PM: > node -e "console.log('\u001b[35m\u001b[1mLove Parcel? You can now donate to our open collective:\u001b[22m\u001b[39m\n > \u001b[34mhttps://opencollective.com/parcel/donate\u001b[0m')"
4:28:29 PM: Love Parcel? You can now donate to our open collective:
4:28:29 PM: > https://opencollective.com/parcel/donate
4:28:29 PM: npm notice created a lockfile as package-lock.json. You should commit this file.
4:28:29 PM: npm WARN optional SKIPPING OPTIONAL DEPENDENCY: fsevents@~2.3.2 (node_modules/chokidar/node_modules/fsevents):
4:28:29 PM: npm WARN notsup SKIPPING OPTIONAL DEPENDENCY: Unsupported platform for fsevents@2.3.3: wanted {"os":"darwin","arch":"any"} (current: {"os":"linux","arch":"x64"})
4:28:29 PM: npm WARN optional SKIPPING OPTIONAL DEPENDENCY: @elm_binaries/win32_x64@0.19.1-0 (node_modules/elm/node_modules/@elm_binaries/win32_x64):
4:28:29 PM: npm WARN notsup SKIPPING OPTIONAL DEPENDENCY: Unsupported platform for @elm_binaries/win32_x64@0.19.1-0: wanted {"os":"win32","arch":"x64"} (current: {"os":"linux","arch":"x64"})
4:28:29 PM: npm WARN optional SKIPPING OPTIONAL DEPENDENCY: @elm_binaries/darwin_arm64@0.19.1-0 (node_modules/elm/node_modules/@elm_binaries/darwin_arm64):
4:28:29 PM: npm WARN notsup SKIPPING OPTIONAL DEPENDENCY: Unsupported platform for @elm_binaries/darwin_arm64@0.19.1-0: wanted {"os":"darwin","arch":"arm64"} (current: {"os":"linux","arch":"x64"})
4:28:29 PM: npm WARN optional SKIPPING OPTIONAL DEPENDENCY: @elm_binaries/darwin_x64@0.19.1-0 (node_modules/elm/node_modules/@elm_binaries/darwin_x64):
4:28:29 PM: npm WARN notsup SKIPPING OPTIONAL DEPENDENCY: Unsupported platform for @elm_binaries/darwin_x64@0.19.1-0: wanted {"os":"darwin","arch":"x64"} (current: {"os":"linux","arch":"x64"})
4:28:29 PM: npm WARN optional SKIPPING OPTIONAL DEPENDENCY: fsevents@~2.1.2 (node_modules/elm-spa/node_modules/chokidar/node_modules/fsevents):
4:28:29 PM: npm WARN notsup SKIPPING OPTIONAL DEPENDENCY: Unsupported platform for fsevents@2.1.3: wanted {"os":"darwin","arch":"any"} (current: {"os":"linux","arch":"x64"})
4:28:29 PM: npm WARN optional SKIPPING OPTIONAL DEPENDENCY: fsevents@^1.2.7 (node_modules/@parcel/watcher/node_modules/chokidar/node_modules/fsevents):
4:28:29 PM: npm WARN notsup SKIPPING OPTIONAL DEPENDENCY: Unsupported platform for fsevents@1.2.13: wanted {"os":"darwin","arch":"any"} (current: {"os":"linux","arch":"x64"})
4:28:29 PM: npm WARN elm-spa-parcel@1.0.0 No repository field.
4:28:29 PM: added 971 packages from 497 contributors and audited 977 packages in 18.861s
4:28:29 PM: 112 packages are looking for funding
4:28:29 PM: run `npm fund` for details
4:28:29 PM: found 43 vulnerabilities (2 low, 28 moderate, 13 high)
4:28:29 PM: run `npm audit fix` to fix them, or `npm audit` for details
4:28:30 PM: npm packages installed
4:28:30 PM: Successfully installed dependencies
4:28:30 PM: Starting build script
4:28:31 PM: Detected 1 framework(s)
4:28:31 PM: "parcel" at version "1.12.5"
4:28:31 PM: Section completed: initializing
Building
Failed
Building
Failed
4:28:33 PM: Netlify Build
4:28:33 PM: ────────────────────────────────────────────────────────────────
4:28:33 PM:
4:28:33 PM: ❯ Version
4:28:33 PM: @netlify/build 29.58.1
4:28:33 PM:
4:28:33 PM: ❯ Flags
4:28:33 PM: accountId: 5a4dd875a6188f52373ec662
4:28:33 PM: baseRelDir: true
4:28:33 PM: buildId: 677ea7714882150008e787cd
4:28:33 PM: deployId: 677ea7714882150008e787cf
4:28:33 PM:
4:28:33 PM: ❯ Current directory
4:28:33 PM: /opt/build/repo
4:28:33 PM:
4:28:33 PM: ❯ Config file
4:28:33 PM: /opt/build/repo/netlify.toml
4:28:33 PM:
4:28:33 PM: ❯ Context
4:28:33 PM: deploy-preview
4:28:33 PM:
4:28:33 PM: build.command from netlify.toml
4:28:33 PM: ────────────────────────────────────────────────────────────────
4:28:33 PM:
4:28:33 PM: $ npm run build
4:28:33 PM: > elm-spa-parcel@1.0.0 build /opt/build/repo
4:28:33 PM: > npm run build:elm-spa && npm run build:elm
4:28:33 PM: > elm-spa-parcel@1.0.0 build:elm-spa /opt/build/repo
4:28:33 PM: > elm-spa build .
4:28:35 PM: ! elm-spa failed to understand an error
4:28:35 PM: Please report the output below to https://github.com/ryan-haskell/elm-spa/issues
4:28:35 PM: -----
4:28:35 PM: {}
4:28:35 PM: -----
4:28:35 PM: ! elm-spa failed to understand an error
4:28:35 PM: Please send the output above to https://github.com/ryan-haskell/elm-spa/issues
4:28:35 PM: npm ERR! code ELIFECYCLE
4:28:35 PM: npm ERR! errno 1
4:28:35 PM: npm ERR! elm-spa-parcel@1.0.0 build:elm-spa: `elm-spa build .`
4:28:35 PM: npm ERR! Exit status 1
4:28:35 PM: npm ERR!
4:28:35 PM: npm ERR! Failed at the elm-spa-parcel@1.0.0 build:elm-spa script.
4:28:35 PM: npm ERR! This is probably not a problem with npm. There is likely additional logging output above.
4:28:35 PM: npm ERR! A complete log of this run can be found in:
4:28:35 PM: npm ERR! /opt/buildhome/.npm/_logs/2025-01-08T16_28_35_653Z-debug.log
4:28:35 PM: npm ERR! code ELIFECYCLE
4:28:35 PM: npm ERR! errno 1
4:28:35 PM: npm ERR! elm-spa-parcel@1.0.0 build: `npm run build:elm-spa && npm run build:elm`
4:28:35 PM: npm ERR! Exit status 1
4:28:35 PM: npm ERR!
4:28:35 PM: npm ERR! Failed at the elm-spa-parcel@1.0.0 build script.
4:28:35 PM: npm ERR! This is probably not a problem with npm. There is likely additional logging output above.
4:28:35 PM: npm ERR! A complete log of this run can be found in:
4:28:35 PM: npm ERR! /opt/buildhome/.npm/_logs/2025-01-08T16_28_35_702Z-debug.log
4:28:35 PM:
4:28:35 PM: "build.command" failed
4:28:35 PM: ────────────────────────────────────────────────────────────────
4:28:35 PM:
4:28:35 PM: Error message
4:28:35 PM: Command failed with exit code 1: npm run build (https://ntl.fyi/exit-code-1)
4:28:35 PM:
4:28:35 PM: Error location
4:28:35 PM: In build.command from netlify.toml:
4:28:35 PM: npm run build
4:28:35 PM:
4:28:35 PM: Resolved config
4:28:35 PM: build:
4:28:35 PM: command: npm run build
4:28:35 PM: commandOrigin: config
4:28:35 PM: environment:
4:28:35 PM: - REVIEW_ID
4:28:35 PM: publish: /opt/build/repo/dist
4:28:35 PM: publishOrigin: config
4:28:35 PM: redirects:
4:28:36 PM: Failed during stage 'building site': Build script returned non-zero exit code: 2 (https://ntl.fyi/exit-code-2)
4:28:36 PM: - from: /*
status: 200
to: /
redirectsOrigin: config
status: 200
to: /
redirectsOrigin: config
4:28:36 PM: Build failed due to a user error: Build script returned non-zero exit code: 2
4:28:36 PM: Failing build: Failed to build site
4:28:36 PM: Finished processing build request in 54.302s
Deploying
Skipped
Deploying
Skipped
There is no log for this section
Cleanup
Skipped
Cleanup
Skipped
There is no log for this section
Post-processing
Skipped
Post-processing
Skipped
There is no log for this section