Skip to main content

Deploy details

Your deploy failed due to an error

Deploy failed for erlang-org-garazdawi

Bumb asdf version

Branch Deploy: master@fd7bcbc

Deploy log

Initializing

Complete
2:56:59 PM: Build ready to start
2:57:18 PM: build-image version: 9c9fb6952e50bb092d4b66daf2368677e5c68e34 (focal)
2:57:18 PM: buildbot version: 9c9fb6952e50bb092d4b66daf2368677e5c68e34
2:57:18 PM: Fetching cached dependencies
2:57:18 PM: Starting to download cache of 681.3MB
2:57:20 PM: Finished downloading cache in 1.758s
2:57:20 PM: Starting to extract cache
2:57:28 PM: Finished extracting cache in 8.267s
2:57:29 PM: Finished fetching cache in 10.126s
2:57:29 PM: Starting to prepare the repo for build
2:57:29 PM: Preparing Git Reference refs/heads/master
2:57:31 PM: Starting to install dependencies
2:57:31 PM: Started restoring cached mise cache
2:57:32 PM: Finished restoring cached mise cache
2:57:33 PM: mise python@3.13.2 install
2:57:33 PM: mise python@3.13.2 download cpython-3.13.2+20250212-x86_64-unknown-linux-gnu-install_only_stripped.tar.gz
2:57:33 PM: mise python@3.13.2 extract cpython-3.13.2+20250212-x86_64-unknown-linux-gnu-install_only_stripped.tar.gz
2:57:35 PM: mise python@3.13.2 python --version
2:57:35 PM: mise python@3.13.2 Python 3.13.2
2:57:35 PM: mise python@3.13.2 installed
2:57:35 PM: Python version set to 3.13
2:57:37 PM: Collecting pipenv
2:57:37 PM: Downloading pipenv-2024.4.1-py3-none-any.whl.metadata (17 kB)
2:57:37 PM: Collecting certifi (from pipenv)
2:57:37 PM: Downloading certifi-2025.1.31-py3-none-any.whl.metadata (2.5 kB)
2:57:37 PM: Collecting packaging>=22 (from pipenv)
2:57:37 PM: Downloading packaging-24.2-py3-none-any.whl.metadata (3.2 kB)
2:57:38 PM: Collecting setuptools>=67 (from pipenv)
2:57:38 PM: Downloading setuptools-75.8.0-py3-none-any.whl.metadata (6.7 kB)
2:57:38 PM: Collecting virtualenv>=20.24.2 (from pipenv)
2:57:38 PM: Downloading virtualenv-20.29.2-py3-none-any.whl.metadata (4.5 kB)
2:57:38 PM: Collecting distlib<1,>=0.3.7 (from virtualenv>=20.24.2->pipenv)
2:57:38 PM: Downloading distlib-0.3.9-py2.py3-none-any.whl.metadata (5.2 kB)
2:57:38 PM: Collecting filelock<4,>=3.12.2 (from virtualenv>=20.24.2->pipenv)
2:57:38 PM: Downloading filelock-3.17.0-py3-none-any.whl.metadata (2.9 kB)
2:57:38 PM: Collecting platformdirs<5,>=3.9.1 (from virtualenv>=20.24.2->pipenv)
2:57:38 PM: Downloading platformdirs-4.3.6-py3-none-any.whl.metadata (11 kB)
2:57:38 PM: Downloading pipenv-2024.4.1-py3-none-any.whl (3.0 MB)
2:57:38 PM: ━━━━━━━━━━━━━━━━━━━━━━━━━━━━━━━━━━━━━━━━ 3.0/3.0 MB 31.4 MB/s eta 0:00:00
2:57:38 PM: Downloading packaging-24.2-py3-none-any.whl (65 kB)
2:57:38 PM: Downloading setuptools-75.8.0-py3-none-any.whl (1.2 MB)
2:57:38 PM: ━━━━━━━━━━━━━━━━━━━━━━━━━━━━━━━━━━━━━━━━ 1.2/1.2 MB 25.4 MB/s eta 0:00:00
2:57:38 PM: Downloading virtualenv-20.29.2-py3-none-any.whl (4.3 MB)
2:57:38 PM: ━━━━━━━━━━━━━━━━━━━━━━━━━━━━━━━━━━━━━━━━ 4.3/4.3 MB 88.6 MB/s eta 0:00:00
2:57:38 PM: Downloading certifi-2025.1.31-py3-none-any.whl (166 kB)
2:57:39 PM: Downloading distlib-0.3.9-py2.py3-none-any.whl (468 kB)
2:57:39 PM: Downloading filelock-3.17.0-py3-none-any.whl (16 kB)
2:57:39 PM: Downloading platformdirs-4.3.6-py3-none-any.whl (18 kB)
2:57:39 PM: Installing collected packages: distlib, setuptools, platformdirs, packaging, filelock, certifi, virtualenv, pipenv
2:57:43 PM: Successfully installed certifi-2025.1.31 distlib-0.3.9 filelock-3.17.0 packaging-24.2 pipenv-2024.4.1 platformdirs-4.3.6 setuptools-75.8.0 virtualenv-20.29.2
2:57:43 PM: [notice] A new release of pip is available: 24.3.1 -> 25.0.1
2:57:43 PM: [notice] To update, run: pip install --upgrade pip
2:57:44 PM: Required ruby-3.3.0 is not installed.
2:57:44 PM: To install do: 'rvm install "ruby-3.3.0"'
2:57:44 PM: Attempting Ruby version 3.3.0, read from .ruby-version file
2:57:44 PM: Required ruby-3.3.0 is not installed - installing.
2:57:45 PM: Searching for binary rubies, this might take some time.
2:57:46 PM: Checking requirements for ubuntu.
2:57:46 PM: Requirements installation successful.
2:57:46 PM: ruby-3.3.0 - #configure
2:57:46 PM: ruby-3.3.0 - #download
2:57:48 PM: No checksum for downloaded archive, recording checksum in user configuration.
2:57:48 PM: ruby-3.3.0 - #validate archive
2:57:53 PM: ruby-3.3.0 - #extract
2:57:57 PM: ruby-3.3.0 - #validate binary
2:57:57 PM: ruby-3.3.0 - #setup
2:57:58 PM: ruby-3.3.0 - #gemset created /opt/buildhome/.rvm/gems/ruby-3.3.0@global
2:57:58 PM: ruby-3.3.0 - #importing gemset /opt/buildhome/.rvm/gemsets/global.gems........................................
2:57:58 PM: ruby-3.3.0 - #generating global wrappers........
2:57:58 PM: ruby-3.3.0 - #gemset created /opt/buildhome/.rvm/gems/ruby-3.3.0
2:57:58 PM: ruby-3.3.0 - #importing gemsetfile /opt/buildhome/.rvm/gemsets/default.gems evaluated to empty gem list
2:57:59 PM: ruby-3.3.0 - #generating default wrappers........
2:57:59 PM: Using /opt/buildhome/.rvm/gems/ruby-3.3.0
2:57:59 PM: Using Ruby version 3.3.0
2:58:00 PM: Using Bundler version 2.5.6 from Gemfile.lock
2:58:00 PM: Successfully installed bundler-2.5.6
2:58:00 PM: 1 gem installed
2:58:00 PM: Started restoring cached ruby gems
2:58:00 PM: Finished restoring cached ruby gems
2:58:00 PM: Installing gem bundle
2:58:01 PM: [DEPRECATED] The `--path` flag is deprecated because it relies on being remembered across bundler invocations, which bundler will no longer do in future versions. Instead please use `bundle config set path '/opt/build/cache/bundle'`, and stop using this flag
2:58:01 PM: [DEPRECATED] The --binstubs option will be removed in favor of `bundle binstubs --all`
2:58:02 PM: Fetching gem metadata from https://rubygems.org/..........
2:58:02 PM: Fetching rake 13.2.1
2:58:02 PM: Installing rake 13.2.1
2:58:02 PM: Fetching public_suffix 6.0.1
2:58:02 PM: Fetching bigdecimal 3.1.9
2:58:02 PM: Fetching concurrent-ruby 1.3.5
2:58:02 PM: Fetching csv 3.3.2
2:58:02 PM: Fetching ffi 1.17.1 (x86_64-linux-gnu)
2:58:02 PM: Fetching json 2.10.1
2:58:02 PM: Fetching rexml 3.4.1
2:58:02 PM: Fetching rouge 4.5.1
2:58:02 PM: Fetching unicode-display_width 2.6.0
2:58:02 PM: Fetching webrick 1.9.1
2:58:02 PM: Installing public_suffix 6.0.1
2:58:02 PM: Installing json 2.10.1 with native extensions
2:58:02 PM: Installing csv 3.3.2
2:58:03 PM: Installing unicode-display_width 2.6.0
2:58:03 PM: Fetching addressable 2.8.7
2:58:03 PM: Installing bigdecimal 3.1.9 with native extensions
2:58:03 PM: Installing webrick 1.9.1
2:58:03 PM: Installing rexml 3.4.1
2:58:03 PM: Installing addressable 2.8.7
2:58:03 PM: Installing concurrent-ruby 1.3.5
2:58:03 PM: Installing rouge 4.5.1
2:58:03 PM: Installing ffi 1.17.1 (x86_64-linux-gnu)
2:58:03 PM: Fetching kramdown 2.5.1
2:58:03 PM: Installing kramdown 2.5.1
2:58:03 PM: Fetching i18n 1.14.7
2:58:03 PM: Installing i18n 1.14.7
2:58:03 PM: Fetching rb-inotify 0.11.1
2:58:03 PM: Installing rb-inotify 0.11.1
2:58:09 PM: Fetching google-protobuf 4.29.3 (x86_64-linux)
2:58:09 PM: Installing google-protobuf 4.29.3 (x86_64-linux)
2:58:09 PM: Fetching sass-embedded 1.85.0 (x86_64-linux-gnu)
2:58:09 PM: Installing sass-embedded 1.85.0 (x86_64-linux-gnu)
2:58:09 PM: Fetching jekyll-sass-converter 3.1.0
2:58:09 PM: Installing jekyll-sass-converter 3.1.0
2:58:09 PM: Fetching jekyll 4.4.1
2:58:09 PM: Installing jekyll 4.4.1
2:58:09 PM: Bundle complete! 6 Gemfile dependencies, 38 gems now installed.
2:58:09 PM: Bundled gems are installed into `/opt/build/cache/bundle`
2:58:09 PM: Gem bundle installed
2:58:10 PM: Started restoring cached go cache
2:58:10 PM: Finished restoring cached go cache
2:58:10 PM: Installing Go version 1.16.5 (requested 1.16.5)
2:58:14 PM: go version go1.16.5 linux/amd64
2:58:15 PM: Using PHP version 8.0
2:58:16 PM: Started restoring cached Node.js version
2:58:19 PM: Finished restoring cached Node.js version
2:58:19 PM: Attempting Node.js version '20.11.1' from .nvmrc
2:58:19 PM: v20.11.1 is already installed.
2:58:19 PM: Now using node v20.11.1 (npm v10.2.4)
2:58:19 PM: Enabling Node.js Corepack
2:58:19 PM: Started restoring cached build plugins
2:58:19 PM: Finished restoring cached build plugins
2:58:19 PM: Started restoring cached corepack dependencies
2:58:19 PM: Finished restoring cached corepack dependencies
2:58:19 PM: No npm workspaces detected
2:58:19 PM: Started restoring cached node modules
2:58:19 PM: Finished restoring cached node modules
2:58:19 PM: Installing npm packages using npm version 10.2.4
2:58:22 PM: added 16 packages, removed 14 packages, changed 97 packages, and audited 386 packages in 2s
2:58:22 PM: 60 packages are looking for funding
2:58:22 PM: run `npm fund` for details
2:58:22 PM: 6 vulnerabilities (4 moderate, 2 high)
2:58:22 PM: To address issues that do not require attention, run:
2:58:22 PM: npm audit fix
2:58:22 PM: To address all issues (including breaking changes), run:
2:58:22 PM: npm audit fix --force
2:58:22 PM: Run `npm audit` for details.
2:58:22 PM: npm packages installed
2:58:22 PM: Successfully installed dependencies
2:58:22 PM: Starting build script
2:58:24 PM: Detected 1 framework(s)
2:58:24 PM: "jekyll" at version "unknown"
2:58:24 PM: Section completed: initializing

Building

Failed
2:58:25 PM: Netlify Build
2:58:25 PM: ────────────────────────────────────────────────────────────────
2:58:25 PM:
2:58:25 PM: ❯ Version
2:58:25 PM: @netlify/build 29.58.9
2:58:25 PM:
2:58:25 PM: ❯ Flags
2:58:25 PM: accountId: 6149c7e97b048ce5e1f3be99
2:58:25 PM: baseRelDir: true
2:58:25 PM: buildId: 67b742bb6a71a30008fa69ee
2:58:25 PM: deployId: 67b742bb6a71a30008fa69f0
2:58:25 PM:
2:58:25 PM: ❯ Current directory
2:58:25 PM: /opt/build/repo
2:58:25 PM:
2:58:25 PM: ❯ Config file
2:58:25 PM: No config file was defined: using default values.
2:58:25 PM:
2:58:25 PM: ❯ Context
2:58:25 PM: branch-deploy
2:58:25 PM:
2:58:25 PM: Build command from Netlify app
2:58:25 PM: ────────────────────────────────────────────────────────────────
2:58:25 PM: ​
2:58:25 PM: $ make netlify
2:58:25 PM: rm -rf _patches docs _eeps faq _clones eeps assets/js
2:58:26 PM: make -j 32 --debug=basic BUNDLE_PATH=/opt/build/cache/bundle JEKYLL_ENV=production
2:58:26 PM: GNU Make 4.2.1
2:58:26 PM: Built for x86_64-pc-linux-gnu
2:58:26 PM: Copyright (C) 1988-2016 Free Software Foundation, Inc.
2:58:26 PM: License GPLv3+: GNU GPL version 3 or later <http://gnu.org/licenses/gpl.html&gt;
2:58:26 PM: This is free software: you are free to change and redistribute it.
2:58:26 PM: There is NO WARRANTY, to the extent permitted by law.
2:58:26 PM: Reading makefiles...
2:58:26 PM: Updating makefiles....
2:58:26 PM: Updating goal targets....
2:58:26 PM: File 'build' does not exist.
2:58:26 PM: File 'setup' does not exist.
2:58:26 PM: File 'setup_gems' does not exist.
2:58:26 PM: Must remake target 'setup_gems'.
2:58:26 PM: Successfully remade target file 'setup_gems'.
2:58:26 PM: File 'setup_npm' does not exist.
2:58:26 PM: File 'assets/js' does not exist.
2:58:26 PM: Must remake target 'assets/js'.
2:58:26 PM: make[1]: Entering directory '/opt/build/repo'
2:58:26 PM: mkdir -p assets/js
2:58:26 PM: File 'assets/js/doc-search.bundle.js' does not exist.
2:58:26 PM: File 'assets/js/bootstrap' does not exist.
2:58:26 PM: File 'assets/js/fontawesome-free' does not exist.
2:58:26 PM: File 'assets/webfonts/fontawesome-free' does not exist.
2:58:26 PM: File 'assets/webfonts' does not exist.
2:58:26 PM: Must remake target 'assets/webfonts'.
2:58:26 PM: mkdir -p assets/webfonts
2:58:26 PM: File 'assets/js/prismjs' does not exist.
2:58:26 PM: File '_patches' does not exist.
2:58:26 PM: File 'otp_versions.table' does not exist.
2:58:26 PM: Must remake target 'otp_versions.table'.
2:58:26 PM: File 'docs' does not exist.
2:58:26 PM: File '_eeps' does not exist.
2:58:26 PM: File '_clones/eep' does not exist.
2:58:26 PM: File '_clones' does not exist.
2:58:26 PM: Must remake target '_clones'.
2:58:26 PM: mkdir -p _clones
2:58:26 PM: File 'eeps' does not exist.
2:58:26 PM: File 'faq' does not exist.
2:58:26 PM: File '_clones/faq' does not exist.
2:58:26 PM: File '_redirects' does not exist.
2:58:26 PM: File 'build' does not exist.
2:58:26 PM: File 'setup' does not exist.
2:58:26 PM: File 'setup_npm' does not exist.
2:58:26 PM: Prerequisite 'package-lock.json' is newer than target 'node_modules'.
2:58:26 PM: Must remake target 'node_modules'.
2:58:26 PM: npm install
2:58:26 PM: File 'assets/js/doc-search.bundle.js' does not exist.
2:58:26 PM: Must remake target 'assets/js/doc-search.bundle.js'.
2:58:26 PM: npm run build
2:58:26 PM: File 'assets/js/bootstrap' does not exist.
2:58:26 PM: Must remake target 'assets/js/bootstrap'.
2:58:26 PM: ln -s ../../node_modules/bootstrap assets/js/bootstrap
2:58:26 PM: File 'assets/js/fontawesome-free' does not exist.
2:58:26 PM: Must remake target 'assets/js/fontawesome-free'.
2:58:26 PM: ln -s ../../node_modules/@fortawesome/fontawesome-free/js assets/js/fontawesome-free
2:58:26 PM: File 'assets/webfonts/fontawesome-free' does not exist.
2:58:26 PM: Must remake target 'assets/webfonts/fontawesome-free'.
2:58:26 PM: ln -s ../../node_modules/@fortawesome/fontawesome-free/webfonts assets/webfonts/fontawesome-free
2:58:26 PM: File 'assets/js/prismjs' does not exist.
2:58:26 PM: Must remake target 'assets/js/prismjs'.
2:58:26 PM: ln -s ../../node_modules/prismjs assets/js/prismjs
2:58:26 PM: % Total % Received % Xferd Average Speed Time Time Time Current
2:58:26 PM: Dload Upload Total Spent Left Speed
2:58:26 PM: 0 0 0 0 0 0 0 0 --:--:-- --:--:-- --:--:-- 0 File '_patches' does not exist.
2:58:26 PM: File 'docs' does not exist.
2:58:26 PM: File '_eeps' does not exist.
2:58:26 PM: File '_clones/eep' does not exist.
2:58:26 PM: Must remake target '_clones/eep'.
2:58:26 PM: git clone https://github.com/erlang/eep _clones/eep
2:58:26 PM: File 'eeps' does not exist.
2:58:26 PM: File 'faq' does not exist.
2:58:26 PM: File '_clones/faq' does not exist.
2:58:26 PM: Must remake target '_clones/faq'.
2:58:26 PM: git clone https://github.com/matthiasl/Erlang-FAQ _clones/faq
2:58:26 PM: File '_redirects' does not exist.
2:58:26 PM: Cloning into '_clones/eep'...
2:58:26 PM: Cloning into '_clones/faq'...
2:58:26 PM: 100 254k 100 254k 0 0 8224k 0 --:--:-- --:--:-- --:--:-- 8224k
2:58:26 PM: File 'build' does not exist.
2:58:26 PM: File 'setup' does not exist.
2:58:26 PM: File 'setup_npm' does not exist.
2:58:26 PM: File '_patches' does not exist.
2:58:26 PM: Must remake target '_patches'.
2:58:26 PM: if [ ! -d _patches ]; then git clone --single-branch -b _patches https://github.com/erlang/erlang-org _patches; fi
2:58:26 PM: File 'docs' does not exist.
2:58:26 PM: Must remake target 'docs'.
2:58:26 PM: if [ ! -d docs ]; then git clone --single-branch -b docs https://github.com/erlang/erlang-org docs; fi
2:58:26 PM: File '_eeps' does not exist.
2:58:26 PM: File 'eeps' does not exist.
2:58:26 PM: File 'faq' does not exist.
2:58:26 PM: File '_redirects' does not exist.
2:58:26 PM: Cloning into '_patches'...
2:58:26 PM: Cloning into 'docs'...
2:58:26 PM: > erlang-org@1.0.0 build
2:58:26 PM: > webpack --config ./webpack.js
2:58:26 PM: File 'build' does not exist.
2:58:26 PM: File 'setup' does not exist.
2:58:26 PM: File 'setup_npm' does not exist.
2:58:26 PM: File '_eeps' does not exist.
2:58:26 PM: File 'eeps' does not exist.
2:58:26 PM: File 'faq' does not exist.
2:58:26 PM: Must remake target 'faq'.
2:58:26 PM: if [ ! -d faq ]; then git clone --single-branch -b faq https://github.com/erlang/erlang-org faq; fi
2:58:26 PM: File '_redirects' does not exist.
2:58:26 PM: Cloning into 'faq'...
2:58:26 PM: cd _clones/eep && ./build.pl
2:58:26 PM: perl -w md/Markdown.pl README.md > README.html
2:58:27 PM: perl -w -CSD eep-index.pl eeps/eep-0000.md | perl -w -CSD eep-pre.pl | perl -w md/Markdown.pl > eeps/eep-0000.html
2:58:27 PM: if [ ! -f _patches/0f755af3d780bbf7b88157136ac98f986fe338b8721eb0f7c6757ed4e3eeb8cd ]; then make patches; fi
2:58:27 PM: GNU Make 4.2.1
2:58:27 PM: Built for x86_64-pc-linux-gnu
2:58:27 PM: Copyright (C) 1988-2016 Free Software Foundation, Inc.
2:58:27 PM: License GPLv3+: GNU GPL version 3 or later <http://gnu.org/licenses/gpl.html&gt;
2:58:27 PM: This is free software: you are free to change and redistribute it.
2:58:27 PM: There is NO WARRANTY, to the extent permitted by law.
2:58:27 PM: Reading makefiles...
2:58:27 PM: Updating makefiles....
2:58:27 PM: perl -w -CSD eep-pre.pl eeps/eep-0001.md | perl -w md/Markdown.pl > eeps/eep-0001.html
2:58:27 PM: Updating goal targets....
2:58:27 PM: File 'patches' does not exist.
2:58:27 PM: File '_scripts/_build/default/bin/erlang-org' does not exist.
2:58:27 PM: Must remake target '_scripts/_build/default/bin/erlang-org'.
2:58:27 PM: make[2]: Entering directory '/opt/build/repo'
2:58:27 PM: make -C _scripts
2:58:27 PM: GNU Make 4.2.1
2:58:27 PM: Built for x86_64-pc-linux-gnu
2:58:27 PM: Copyright (C) 1988-2016 Free Software Foundation, Inc.
2:58:27 PM: License GPLv3+: GNU GPL version 3 or later <http://gnu.org/licenses/gpl.html&gt;
2:58:27 PM: This is free software: you are free to change and redistribute it.
2:58:27 PM: There is NO WARRANTY, to the extent permitted by law.
2:58:27 PM: Reading makefiles...
2:58:27 PM: Updating makefiles....
2:58:27 PM: Updating goal targets....
2:58:27 PM: File 'all' does not exist.
2:58:27 PM: Must remake target 'all'.
2:58:27 PM: make[3]: Entering directory '/opt/build/repo/_scripts'
2:58:27 PM: rebar3 escriptize
2:58:27 PM: make[3]: rebar3: Command not found
2:58:27 PM: make[3]: *** [Makefile:2: all] Error 127
2:58:27 PM: make[3]: Leaving directory '/opt/build/repo/_scripts'
2:58:27 PM: make[2]: *** [Makefile:47: _scripts/_build/default/bin/erlang-org] Error 2
2:58:27 PM: make[2]: Leaving directory '/opt/build/repo'
2:58:27 PM: make[1]: *** [Makefile:93: _patches] Error 2
2:58:27 PM: make[1]: *** Waiting for unfinished jobs....
2:58:27 PM: perl -w -CSD eep-pre.pl eeps/eep-0002.md | perl -w md/Markdown.pl > eeps/eep-0002.html
2:58:27 PM: perl -w -CSD eep-pre.pl eeps/eep-0003.md | perl -w md/Markdown.pl > eeps/eep-0003.html
2:58:27 PM: ls -la faq
2:58:27 PM: total 452
2:58:27 PM: drwxr-xr-x 4 buildbot buildbot 4096 Feb 20 14:58 .
2:58:27 PM: drwxr-xr-x 28 buildbot root 4096 Feb 20 14:58 ..
2:58:27 PM: -rw-r--r-- 1 buildbot buildbot 0 Feb 20 14:58 24126d5ca894a2646df1877e81c50420299c6ed717c5db420b3a902b78b9f5cb
2:58:27 PM: -rw-r--r-- 1 buildbot buildbot 47272 Feb 20 14:58 academic.html
2:58:27 PM: -rw-r--r-- 1 buildbot buildbot 3342 Feb 20 14:58 erlang-logo.gif
2:58:27 PM: -rw-r--r-- 1 buildbot buildbot 5837 Feb 20 14:58 erlang-logo.png
2:58:27 PM: -rw-r--r-- 1 buildbot buildbot 22158 Feb 20 14:58 faq.html
2:58:27 PM: -rw-r--r-- 1 buildbot buildbot 24328 Feb 20 14:58 faq_questions.html
2:58:27 PM: -rw-r--r-- 1 buildbot buildbot 26860 Feb 20 14:58 getting_started.html
2:58:27 PM: drwxr-xr-x 8 buildbot buildbot 163 Feb 20 14:58 .git
2:58:27 PM: -rw-r--r-- 1 buildbot buildbot 40787 Feb 20 14:58 how_do_i.html
2:58:27 PM: -rw-r--r-- 1 buildbot buildbot 27591 Feb 20 14:58 implementations.html
2:58:27 PM: -rw-r--r-- 1 buildbot buildbot 35345 Feb 20 14:58 introduction.html
2:58:27 PM: drwxr-xr-x 3 buildbot buildbot 22 Feb 20 14:58 js
2:58:27 PM: -rw-r--r-- 1 buildbot buildbot 28244 Feb 20 14:58 libraries.html
2:58:27 PM: -rw-r--r-- 1 buildbot buildbot 26432 Feb 20 14:58 mnesia.html
2:58:27 PM: -rw-r--r-- 1 buildbot buildbot 40244 Feb 20 14:58 obtaining.html
2:58:27 PM: -rw-r--r-- 1 buildbot buildbot 10274 Feb 20 14:58 otp_doc.css
2:58:27 PM: -rw-r--r-- 1 buildbot buildbot 39360 Feb 20 14:58 problems.html
2:58:27 PM: -rw-r--r-- 1 buildbot buildbot 22158 Feb 20 14:58 t1.html
2:58:27 PM: -rw-r--r-- 1 buildbot buildbot 31432 Feb 20 14:58 tools.html
2:58:27 PM: FAQ_HASH=d394b239d1c5276dbf31ee79f4cc8f65fa5e54798ff47d810a3f7637076ee23d && \" account_id=6149c7e97b048ce5e1f3be99 account_type=free-is-free build_command=true build_from_zip=false build_id=67b742bb6a71a30008fa69ee build_zip_url=
2:58:27 PM: if [ ! -f faq/${FAQ_HASH} ]; then \" account_id=6149c7e97b048ce5e1f3be99 account_type=free-is-free build_command=true build_from_zip=false build_id=67b742bb6a71a30008fa69ee build_zip_url=
2:58:27 PM: rm -rf faq/* && \
(cd _clones/faq && LC_ALL="en_US-UTF8" make && make install FAQ_ROOT=../../faq) && \
touch faq/${FAQ_HASH}; \
fi
GNU Make 4.2.1
2:58:27 PM: Built for x86_64-pc-linux-gnu
2:58:27 PM: Copyright (C) 1988-2016 Free Software Foundation, Inc.
2:58:27 PM: License GPLv3+: GNU GPL version 3 or later <http://gnu.org/licenses/gpl.html&gt;
2:58:27 PM: This is free software: you are free to change and redistribute it.
2:58:27 PM: There is NO WARRANTY, to the extent permitted by law.
2:58:27 PM: make[2]: Entering directory '/opt/build/repo/_clones/faq'
2:58:27 PM: make[2]: warning: jobserver unavailable: using -j1. Add '+' to parent make rule.
2:58:27 PM: Reading makefiles...
2:58:27 PM: perl -w -CSD eep-pre.pl eeps/eep-0004.md | perl -w md/Markdown.pl > eeps/eep-0004.html
2:58:27 PM: perl -w -CSD eep-pre.pl eeps/eep-0005.md | perl -w md/Markdown.pl > eeps/eep-0005.html
2:58:27 PM: perl -w -CSD eep-pre.pl eeps/eep-0006.md | perl -w md/Markdown.pl > eeps/eep-0006.html
2:58:27 PM: perl -w -CSD eep-pre.pl eeps/eep-0007.md | perl -w md/Markdown.pl > eeps/eep-0007.html
2:58:27 PM: perl -w -CSD eep-pre.pl eeps/eep-0008.md | perl -w md/Markdown.pl > eeps/eep-0008.html
2:58:27 PM: perl -w -CSD eep-pre.pl eeps/eep-0009.md | perl -w md/Markdown.pl > eeps/eep-0009.html
2:58:27 PM: perl -w -CSD eep-pre.pl eeps/eep-0010.md | perl -w md/Markdown.pl > eeps/eep-0010.html
2:58:27 PM: perl -w -CSD eep-pre.pl eeps/eep-0011.md | perl -w md/Markdown.pl > eeps/eep-0011.html
2:58:27 PM: perl -w -CSD eep-pre.pl eeps/eep-0012.md | perl -w md/Markdown.pl > eeps/eep-0012.html
2:58:27 PM: perl -w -CSD eep-pre.pl eeps/eep-0013.md | perl -w md/Markdown.pl > eeps/eep-0013.html
2:58:27 PM: perl -w -CSD eep-pre.pl eeps/eep-0014.md | perl -w md/Markdown.pl > eeps/eep-0014.html
2:58:27 PM: up to date, audited 386 packages in 750ms
2:58:27 PM: 60 packages are looking for funding
2:58:27 PM: run `npm fund` for details
2:58:27 PM: 6 vulnerabilities (4 moderate, 2 high)
2:58:27 PM: To address issues that do not require attention, run:
2:58:27 PM: npm audit fix
2:58:27 PM: To address all issues (including breaking changes), run:
2:58:27 PM: npm audit fix --force
2:58:27 PM: Run `npm audit` for details.
2:58:27 PM: npm run build
2:58:27 PM: perl -w -CSD eep-pre.pl eeps/eep-0015.md | perl -w md/Markdown.pl > eeps/eep-0015.html
2:58:27 PM: perl -w -CSD eep-pre.pl eeps/eep-0016.md | perl -w md/Markdown.pl > eeps/eep-0016.html
2:58:27 PM: perl -w -CSD eep-pre.pl eeps/eep-0017.md | perl -w md/Markdown.pl > eeps/eep-0017.html
2:58:27 PM: perl -w -CSD eep-pre.pl eeps/eep-0018.md | perl -w md/Markdown.pl > eeps/eep-0018.html
2:58:27 PM: Updating makefiles....
2:58:27 PM: Updating goal targets....
2:58:27 PM: File 'all' does not exist.
2:58:27 PM: File 'obj' does not exist.
2:58:27 PM: Must remake target 'obj'.
2:58:27 PM: mkdir obj
2:58:27 PM: Successfully remade target file 'obj'.
2:58:27 PM: File 'obj/faq.html' does not exist.
2:58:27 PM: Must remake target 'obj/faq.html'.
2:58:27 PM: xsltproc --stringparam outdir obj --stringparam gendate "February 20 2025" --stringparam topdocdir . --xinclude -path /usr/lib/erlang/lib/erl_docgen-1.5.2/priv//dtd/ -path /usr/lib/erlang/lib/erl_docgen-1.5.2/priv//dtd_html_entities/ faq_html.xsl faq.xml
2:58:27 PM: perl -w -CSD eep-pre.pl eeps/eep-0019.md | perl -w md/Markdown.pl > eeps/eep-0019.html
2:58:27 PM: perl -w -CSD eep-pre.pl eeps/eep-0020.md | perl -w md/Markdown.pl > eeps/eep-0020.html
2:58:27 PM: error : xmlAddEntity: invalid redeclaration of predefined entity
2:58:27 PM: error : xmlAddEntity: invalid redeclaration of predefined entity
2:58:27 PM: error : xmlAddEntity: invalid redeclaration of predefined entity
2:58:27 PM: error : xmlAddEntity: invalid redeclaration of predefined entity
2:58:27 PM: error : xmlAddEntity: invalid redeclaration of predefined entity
2:58:27 PM: error : xmlAddEntity: invalid redeclaration of predefined entity
2:58:27 PM: error : xmlAddEntity: invalid redeclaration of predefined entity
2:58:27 PM: error : xmlAddEntity: invalid redeclaration of predefined entity
2:58:27 PM: error : xmlAddEntity: invalid redeclaration of predefined entity
2:58:27 PM: error : xmlAddEntity: invalid redeclaration of predefined entity
2:58:27 PM: error : xmlAddEntity: invalid redeclaration of predefined entity
2:58:27 PM: error : xmlAddEntity: invalid redeclaration of predefined entity
2:58:27 PM: error : xmlAddEntity: invalid redeclaration of predefined entity
2:58:27 PM: error : xmlAddEntity: invalid redeclaration of predefined entity
2:58:27 PM: error : xmlAddEntity: invalid redeclaration of predefined entity
2:58:27 PM: error : xmlAddEntity: invalid redeclaration of predefined entity
2:58:27 PM: error : xmlAddEntity: invalid redeclaration of predefined entity
2:58:27 PM: error : xmlAddEntity: invalid redeclaration of predefined entity
2:58:27 PM: error : xmlAddEntity: invalid redeclaration of predefined entity
2:58:27 PM: error : xmlAddEntity: invalid redeclaration of predefined entity
2:58:27 PM: perl -w -CSD eep-pre.pl eeps/eep-0021.md | perl -w md/Markdown.pl > eeps/eep-0021.html
2:58:27 PM: error : xmlAddEntity: invalid redeclaration of predefined entity
2:58:27 PM: error : xmlAddEntity: invalid redeclaration of predefined entity
2:58:27 PM: error : xmlAddEntity: invalid redeclaration of predefined entity
2:58:27 PM: error : xmlAddEntity: invalid redeclaration of predefined entity
2:58:27 PM: Successfully remade target file 'obj/faq.html'.
2:58:27 PM: File 'obj/t1.html' does not exist.
2:58:27 PM: Must remake target 'obj/t1.html'.
2:58:27 PM: cp obj/faq.html obj/t1.html
2:58:27 PM: perl -w -CSD eep-pre.pl eeps/eep-0022.md | perl -w md/Markdown.pl > eeps/eep-0022.html
2:58:27 PM: Successfully remade target file 'obj/t1.html'.
2:58:27 PM: File 'local_copy_of_definions' does not exist.
2:58:27 PM: Must remake target 'local_copy_of_definions'.
2:58:27 PM: cp -a /usr/lib/erlang/lib/erl_docgen-1.5.2/priv//css/otp_doc.css obj/
2:58:27 PM: cp -a /usr/lib/erlang/lib/erl_docgen-1.5.2/priv//images/* obj/
2:58:27 PM: mkdir -p obj/js/flipmenu
2:58:27 PM: cp -a /usr/lib/erlang/lib/erl_docgen-1.5.2/priv//js/flipmenu/* obj/js/flipmenu
2:58:27 PM: Successfully remade target file 'local_copy_of_definions'.
2:58:27 PM: Must remake target 'all'.
2:58:27 PM: Successfully remade target file 'all'.
2:58:27 PM: make[2]: Leaving directory '/opt/build/repo/_clones/faq'
2:58:27 PM: GNU Make 4.2.1
2:58:27 PM: Built for x86_64-pc-linux-gnu
2:58:27 PM: Copyright (C) 1988-2016 Free Software Foundation, Inc.
2:58:27 PM: License GPLv3+: GNU GPL version 3 or later <http://gnu.org/licenses/gpl.html&gt;
2:58:27 PM: This is free software: you are free to change and redistribute it.
2:58:27 PM: There is NO WARRANTY, to the extent permitted by law.
2:58:27 PM: make[2]: Entering directory '/opt/build/repo/_clones/faq'
2:58:27 PM: make[2]: warning: jobserver unavailable: using -j1. Add '+' to parent make rule.
2:58:27 PM: Reading makefiles...
2:58:27 PM: > erlang-org@1.0.0 build
2:58:27 PM: > webpack --config ./webpack.js
2:58:27 PM: perl -w -CSD eep-pre.pl eeps/eep-0023.md | perl -w md/Markdown.pl > eeps/eep-0023.html
2:58:27 PM: perl -w -CSD eep-pre.pl eeps/eep-0024.md | perl -w md/Markdown.pl > eeps/eep-0024.html
2:58:27 PM: perl -w -CSD eep-pre.pl eeps/eep-0025.md | perl -w md/Markdown.pl > eeps/eep-0025.html
2:58:27 PM: perl -w -CSD eep-pre.pl eeps/eep-0026.md | perl -w md/Markdown.pl > eeps/eep-0026.html
2:58:27 PM: perl -w -CSD eep-pre.pl eeps/eep-0027.md | perl -w md/Markdown.pl > eeps/eep-0027.html
2:58:27 PM: perl -w -CSD eep-pre.pl eeps/eep-0028.md | perl -w md/Markdown.pl > eeps/eep-0028.html
2:58:28 PM: perl -w -CSD eep-pre.pl eeps/eep-0029.md | perl -w md/Markdown.pl > eeps/eep-0029.html
2:58:28 PM: perl -w -CSD eep-pre.pl eeps/eep-0030.md | perl -w md/Markdown.pl > eeps/eep-0030.html
2:58:28 PM: perl -w -CSD eep-pre.pl eeps/eep-0031.md | perl -w md/Markdown.pl > eeps/eep-0031.html
2:58:28 PM: perl -w -CSD eep-pre.pl eeps/eep-0032.md | perl -w md/Markdown.pl > eeps/eep-0032.html
2:58:28 PM: perl -w -CSD eep-pre.pl eeps/eep-0033.md | perl -w md/Markdown.pl > eeps/eep-0033.html
2:58:28 PM: Updating makefiles....
2:58:28 PM: Updating goal targets....
2:58:28 PM: File 'install' does not exist.
2:58:28 PM: Must remake target 'install'.
2:58:28 PM: mkdir -p ../../faq
2:58:28 PM: cp -a obj/* ../../faq
Successfully remade target file 'install'.
2:58:28 PM: make[2]: Leaving directory '/opt/build/repo/_clones/faq'
2:58:28 PM: ls -la faq
2:58:28 PM: total 452
2:58:28 PM: drwxr-xr-x 4 buildbot buildbot 4096 Feb 20 14:58 .
2:58:28 PM: drwxr-xr-x 28 buildbot root 4096 Feb 20 14:58 ..
2:58:28 PM: -rw-r--r-- 1 buildbot buildbot 47272 Feb 20 14:58 academic.html
2:58:28 PM: -rw-r--r-- 1 buildbot buildbot 0 Feb 20 14:58 d394b239d1c5276dbf31ee79f4cc8f65fa5e54798ff47d810a3f7637076ee23d
2:58:28 PM: -rw-r--r-- 1 buildbot root 3342 Apr 12 2024 erlang-logo.gif
2:58:28 PM: -rw-r--r-- 1 buildbot root 5837 Apr 12 2024 erlang-logo.png
2:58:28 PM: -rw-r--r-- 1 buildbot buildbot 22161 Feb 20 14:58 faq.html
2:58:28 PM: -rw-r--r-- 1 buildbot buildbot 24328 Feb 20 14:58 faq_questions.html
2:58:28 PM: -rw-r--r-- 1 buildbot buildbot 26860 Feb 20 14:58 getting_started.html
2:58:28 PM: drwxr-xr-x 8 buildbot buildbot 163 Feb 20 14:58 .git
2:58:28 PM: -rw-r--r-- 1 buildbot buildbot 40787 Feb 20 14:58 how_do_i.html
2:58:28 PM: -rw-r--r-- 1 buildbot buildbot 27591 Feb 20 14:58 implementations.html
2:58:28 PM: -rw-r--r-- 1 buildbot buildbot 35345 Feb 20 14:58 introduction.html
2:58:28 PM: drwxr-xr-x 3 buildbot buildbot 22 Feb 20 14:58 js
2:58:28 PM: -rw-r--r-- 1 buildbot buildbot 28244 Feb 20 14:58 libraries.html
2:58:28 PM: -rw-r--r-- 1 buildbot buildbot 26432 Feb 20 14:58 mnesia.html
2:58:28 PM: -rw-r--r-- 1 buildbot buildbot 40244 Feb 20 14:58 obtaining.html
2:58:28 PM: -rw-r--r-- 1 buildbot root 10274 Apr 12 2024 otp_doc.css
2:58:28 PM: -rw-r--r-- 1 buildbot buildbot 39360 Feb 20 14:58 problems.html
2:58:28 PM: -rw-r--r-- 1 buildbot buildbot 22161 Feb 20 14:58 t1.html
2:58:28 PM: -rw-r--r-- 1 buildbot buildbot 31432 Feb 20 14:58 tools.html
2:58:28 PM: perl -w -CSD eep-pre.pl eeps/eep-0034.md | perl -w md/Markdown.pl > eeps/eep-0034.html
2:58:28 PM: perl -w -CSD eep-pre.pl eeps/eep-0035.md | perl -w md/Markdown.pl > eeps/eep-0035.html
2:58:28 PM: perl -w -CSD eep-pre.pl eeps/eep-0036.md | perl -w md/Markdown.pl > eeps/eep-0036.html
2:58:28 PM: perl -w -CSD eep-pre.pl eeps/eep-0037.md | perl -w md/Markdown.pl > eeps/eep-0037.html
2:58:28 PM: perl -w -CSD eep-pre.pl eeps/eep-0038.md | perl -w md/Markdown.pl > eeps/eep-0038.html
2:58:28 PM: perl -w -CSD eep-pre.pl eeps/eep-0039.md | perl -w md/Markdown.pl > eeps/eep-0039.html
2:58:28 PM: perl -w -CSD eep-pre.pl eeps/eep-0040.md | perl -w md/Markdown.pl > eeps/eep-0040.html
2:58:28 PM: perl -w -CSD eep-pre.pl eeps/eep-0041.md | perl -w md/Markdown.pl > eeps/eep-0041.html
2:58:28 PM: perl -w -CSD eep-pre.pl eeps/eep-0042.md | perl -w md/Markdown.pl > eeps/eep-0042.html
2:58:28 PM: perl -w -CSD eep-pre.pl eeps/eep-0043.md | perl -w md/Markdown.pl > eeps/eep-0043.html
2:58:28 PM: perl -w -CSD eep-pre.pl eeps/eep-0044.md | perl -w md/Markdown.pl > eeps/eep-0044.html
2:58:28 PM: perl -w -CSD eep-pre.pl eeps/eep-0045.md | perl -w md/Markdown.pl > eeps/eep-0045.html
2:58:28 PM: perl -w -CSD eep-pre.pl eeps/eep-0046.md | perl -w md/Markdown.pl > eeps/eep-0046.html
2:58:28 PM: perl -w -CSD eep-pre.pl eeps/eep-0047.md | perl -w md/Markdown.pl > eeps/eep-0047.html
2:58:28 PM: perl -w -CSD eep-pre.pl eeps/eep-0048.md | perl -w md/Markdown.pl > eeps/eep-0048.html
2:58:28 PM: perl -w -CSD eep-pre.pl eeps/eep-0049.md | perl -w md/Markdown.pl > eeps/eep-0049.html
2:58:29 PM: perl -w -CSD eep-pre.pl eeps/eep-0050.md | perl -w md/Markdown.pl > eeps/eep-0050.html
2:58:29 PM: perl -w -CSD eep-pre.pl eeps/eep-0051.md | perl -w md/Markdown.pl > eeps/eep-0051.html
2:58:29 PM: perl -w -CSD eep-pre.pl eeps/eep-0052.md | perl -w md/Markdown.pl > eeps/eep-0052.html
2:58:29 PM: perl -w -CSD eep-pre.pl eeps/eep-0053.md | perl -w md/Markdown.pl > eeps/eep-0053.html
2:58:29 PM: perl -w -CSD eep-pre.pl eeps/eep-0054.md | perl -w md/Markdown.pl > eeps/eep-0054.html
2:58:29 PM: perl -w -CSD eep-pre.pl eeps/eep-0055.md | perl -w md/Markdown.pl > eeps/eep-0055.html
2:58:29 PM: perl -w -CSD eep-pre.pl eeps/eep-0056.md | perl -w md/Markdown.pl > eeps/eep-0056.html
2:58:29 PM: perl -w -CSD eep-pre.pl eeps/eep-0057.md | perl -w md/Markdown.pl > eeps/eep-0057.html
2:58:29 PM: perl -w -CSD eep-pre.pl eeps/eep-0058.md | perl -w md/Markdown.pl > eeps/eep-0058.html
2:58:29 PM: perl -w -CSD eep-pre.pl eeps/eep-0059.md | perl -w md/Markdown.pl > eeps/eep-0059.html
2:58:29 PM: perl -w -CSD eep-pre.pl eeps/eep-0060.md | perl -w md/Markdown.pl > eeps/eep-0060.html
2:58:29 PM: perl -w -CSD eep-pre.pl eeps/eep-0061.md | perl -w md/Markdown.pl > eeps/eep-0061.html
2:58:29 PM: perl -w -CSD eep-pre.pl eeps/eep-0062.md | perl -w md/Markdown.pl > eeps/eep-0062.html
2:58:29 PM: perl -w -CSD eep-pre.pl eeps/eep-0063.md | perl -w md/Markdown.pl > eeps/eep-0063.html
2:58:29 PM: perl -w -CSD eep-pre.pl eeps/eep-0064.md | perl -w md/Markdown.pl > eeps/eep-0064.html
2:58:29 PM: perl -w -CSD eep-pre.pl eeps/eep-0065.md | perl -w md/Markdown.pl > eeps/eep-0065.html
2:58:29 PM: perl -w -CSD eep-pre.pl eeps/eep-0066.md | perl -w md/Markdown.pl > eeps/eep-0066.html
2:58:30 PM: perl -w -CSD eep-pre.pl eeps/eep-0067.md | perl -w md/Markdown.pl > eeps/eep-0067.html
2:58:30 PM: perl -w -CSD eep-pre.pl eeps/eep-0068.md | perl -w md/Markdown.pl > eeps/eep-0068.html
2:58:30 PM: perl -w -CSD eep-pre.pl eeps/eep-0069.md | perl -w md/Markdown.pl > eeps/eep-0069.html
2:58:30 PM: perl -w -CSD eep-pre.pl eeps/eep-0070.md | perl -w md/Markdown.pl > eeps/eep-0070.html
2:58:30 PM: perl -w -CSD eep-pre.pl eeps/eep-0071.md | perl -w md/Markdown.pl > eeps/eep-0071.html
2:58:30 PM: perl -w -CSD eep-pre.pl eeps/eep-0072.md | perl -w md/Markdown.pl > eeps/eep-0072.html
2:58:30 PM: perl -w -CSD eep-pre.pl eeps/eep-0073.md | perl -w md/Markdown.pl > eeps/eep-0073.html
2:58:30 PM: perl -w -CSD eep-pre.pl eeps/eep-0074.md | perl -w md/Markdown.pl > eeps/eep-0074.html
2:58:30 PM: perl -w -CSD eep-pre.pl eeps/eep-0075.md | perl -w md/Markdown.pl > eeps/eep-0075.html
2:58:30 PM: perl -w -CSD eep-pre.pl eeps/eep-0076.md | perl -w md/Markdown.pl > eeps/eep-0076.html
2:58:30 PM: perl -w -CSD eep-pre.pl eeps/eep-0077.md | perl -w md/Markdown.pl > eeps/eep-0077.html
2:58:35 PM: asset doc-search.bundle.js 280 KiB [emitted] [minimized] (name: doc-search) 2 related assets
2:58:35 PM: runtime modules 698 bytes 4 modules
2:58:35 PM: orphan modules 107 KiB [orphan] 2 modules
2:58:35 PM: modules by path ./node_modules/ 183 KiB
2:58:37 PM: modules by path ./node_modules/style-loader/dist/runtime/*.js 5.84 KiB 6 modules
modules by path ./node_modules/react/ 6.95 KiB 2 modules
modules by path ./node_modules/react-dom/ 130 KiB 2 modules
modules by path ./node_modules/scheduler/ 4.33 KiB 2 modules
modules by path ./node_modules/css-loader/dist/runtime/*.js 2.74 KiB
./node_modules/css-loader/dist/runtime/sourceMaps.js 505 bytes [built] [code generated]
./node_modules/css-loader/dist/runtime/api.js 2.25 KiB [built] [code generated]
./node_modules/css-loader/dist/cjs.js!./node_modules/@docsearch/css/dist/style.css 32.9 KiB [built] [code generated]
./assets/doc-search.tsx + 2 modules 110 KiB [built] [code generated]
webpack 5.98.0 compiled successfully in 8335 ms
asset doc-search.bundle.js 280 KiB [compared for emit] [minimized] (name: doc-search) 2 related assets
2:58:37 PM: runtime modules 698 bytes 4 modules
2:58:37 PM: orphan modules 107 KiB [orphan] 2 modules
2:58:37 PM: modules by path ./node_modules/ 183 KiB
2:58:39 PM: modules by path ./node_modules/style-loader/dist/runtime/*.js 5.84 KiB 6 modules
modules by path ./node_modules/react/ 6.95 KiB 2 modules
modules by path ./node_modules/react-dom/ 130 KiB 2 modules
modules by path ./node_modules/scheduler/ 4.33 KiB 2 modules
modules by path ./node_modules/css-loader/dist/runtime/*.js 2.74 KiB
./node_modules/css-loader/dist/runtime/sourceMaps.js 505 bytes [built] [code generated]
./node_modules/css-loader/dist/runtime/api.js 2.25 KiB [built] [code generated]
./node_modules/css-loader/dist/cjs.js!./node_modules/@docsearch/css/dist/style.css 32.9 KiB [built] [code generated]
./assets/doc-search.tsx + 2 modules 110 KiB [built] [code generated]
webpack 5.98.0 compiled successfully in 9275 ms
Updating files: 18% (3757/19779)
2:58:39 PM: Updating files: 19% (3759/19779)
2:58:39 PM: Updating files: 20% (3956/19779)
2:58:39 PM: Updating files: 21% (4154/19779)
2:58:39 PM: Updating files: 22% (4352/19779)
2:58:39 PM: Updating files: 23% (4550/19779)
2:58:39 PM: Updating files: 24% (4747/19779)
2:58:39 PM: Updating files: 25% (4945/19779)
2:58:39 PM: Updating files: 26% (5143/19779)
2:58:40 PM: Updating files: 27% (5341/19779)
2:58:40 PM: Updating files: 28% (5539/19779)
2:58:40 PM: Updating files: 29% (5736/19779)
2:58:40 PM: Updating files: 30% (5934/19779)
2:58:40 PM: Updating files: 30% (6000/19779)
2:58:40 PM: Updating files: 31% (6132/19779)
2:58:40 PM: Updating files: 32% (6330/19779)
2:58:40 PM: Updating files: 33% (6528/19779)
2:58:40 PM: Updating files: 34% (6725/19779)
2:58:40 PM: Updating files: 35% (6923/19779)
2:58:40 PM: Updating files: 36% (7121/19779)
2:58:40 PM: Updating files: 37% (7319/19779)
2:58:40 PM: Updating files: 38% (7517/19779)
2:58:40 PM: Updating files: 39% (7714/19779)
2:58:41 PM: Updating files: 40% (7912/19779)
2:58:41 PM: Updating files: 41% (8110/19779)
2:58:41 PM: Updating files: 42% (8308/19779)
2:58:41 PM: Updating files: 42% (8369/19779)
2:58:41 PM: Updating files: 43% (8505/19779)
2:58:41 PM: Updating files: 44% (8703/19779)
2:58:41 PM: Updating files: 45% (8901/19779)
2:58:41 PM: Updating files: 46% (9099/19779)
2:58:42 PM: Updating files: 47% (9297/19779)
2:58:42 PM: Updating files: 48% (9494/19779)
2:58:42 PM: Updating files: 49% (9692/19779)
2:58:42 PM: Updating files: 49% (9751/19779)
2:58:42 PM: Updating files: 50% (9890/19779)
2:58:42 PM: Updating files: 51% (10088/19779)
2:58:42 PM: Updating files: 52% (10286/19779)
2:58:42 PM: Updating files: 53% (10483/19779)
2:58:42 PM: Updating files: 54% (10681/19779)
2:58:42 PM: Updating files: 55% (10879/19779)
2:58:43 PM: Updating files: 56% (11077/19779)
2:58:43 PM: Updating files: 57% (11275/19779)
2:58:43 PM: Updating files: 58% (11472/19779)
2:58:43 PM: Updating files: 58% (11526/19779)
2:58:43 PM: Updating files: 59% (11670/19779)
2:58:43 PM: Updating files: 60% (11868/19779)
2:58:43 PM: Updating files: 61% (12066/19779)
2:58:43 PM: Updating files: 62% (12263/19779)
2:58:43 PM: Updating files: 63% (12461/19779)
2:58:44 PM: Updating files: 64% (12659/19779)
2:58:44 PM: Updating files: 64% (12849/19779)
2:58:44 PM: Updating files: 65% (12857/19779)
2:58:44 PM: Updating files: 66% (13055/19779)
2:58:44 PM: Updating files: 67% (13252/19779)
2:58:44 PM: Updating files: 68% (13450/19779)
2:58:44 PM: Updating files: 69% (13648/19779)
2:58:45 PM: Updating files: 69% (13723/19779)
2:58:46 PM: Updating files: 69% (13845/19779)
2:58:46 PM: Updating files: 70% (13846/19779)
2:58:46 PM: Updating files: 71% (14044/19779)
2:58:46 PM: Updating files: 72% (14241/19779)
2:58:46 PM: Updating files: 73% (14439/19779)
2:58:47 PM: Updating files: 74% (14637/19779)
2:58:47 PM: Updating files: 75% (14835/19779)
2:58:47 PM: Updating files: 76% (15033/19779)
2:58:47 PM: Updating files: 77% (15230/19779)
2:58:47 PM: Updating files: 77% (15414/19779)
2:58:47 PM: Updating files: 78% (15428/19779)
2:58:47 PM: Updating files: 79% (15626/19779)
2:58:47 PM: Updating files: 80% (15824/19779)
2:58:47 PM: Updating files: 81% (16021/19779)
2:58:47 PM: Updating files: 82% (16219/19779)
2:58:48 PM: Updating files: 83% (16417/19779)
2:58:48 PM: Updating files: 84% (16615/19779)
2:58:48 PM: Updating files: 85% (16813/19779)
2:58:48 PM: Updating files: 85% (16857/19779)
2:58:48 PM: Updating files: 86% (17010/19779)
2:58:48 PM: Updating files: 87% (17208/19779)
2:58:49 PM: Updating files: 88% (17406/19779)
2:58:49 PM: Updating files: 89% (17604/19779)
2:58:49 PM: Updating files: 89% (17704/19779)
2:58:49 PM: Updating files: 90% (17802/19779)
2:58:49 PM: Updating files: 91% (17999/19779)
2:58:49 PM: Updating files: 92% (18197/19779)
2:58:49 PM: Updating files: 93% (18395/19779)
2:58:49 PM: Updating files: 94% (18593/19779)
2:58:50 PM: Updating files: 95% (18791/19779)
2:58:50 PM: Updating files: 96% (18988/19779)
2:58:50 PM: Updating files: 97% (19186/19779)
2:58:50 PM: Updating files: 97% (19247/19779)
2:58:50 PM: Updating files: 98% (19384/19779)
2:58:50 PM: Updating files: 99% (19582/19779)
2:58:50 PM: Updating files: 100% (19779/19779)
2:58:50 PM: Updating files: 100% (19779/19779), done.
2:58:50 PM: if [ "production" != "production" ]; then _scripts/download-docs.sh otp_versions.table; fi
2:58:50 PM: make[1]: Leaving directory '/opt/build/repo'
2:58:50 PM: make: *** [Makefile:11: netlify] Error 2
2:58:50 PM:
2:58:50 PM: "build.command" failed
2:58:50 PM: ────────────────────────────────────────────────────────────────
2:58:50 PM: ​
2:58:50 PM: Error message
2:58:50 PM: Command failed with exit code 2: make netlify (https://ntl.fyi/exit-code-2)
2:58:50 PM: ​
2:58:50 PM: Error location
2:58:50 PM: In Build command from Netlify app:
2:58:50 PM: make netlify
2:58:50 PM: ​
2:58:50 PM: Resolved config
2:58:50 PM: build:
2:58:50 PM: command: make netlify
2:58:50 PM: commandOrigin: ui
2:58:50 PM: environment:
2:58:50 PM: - GITHUB_TOKEN
2:58:50 PM: publish: /opt/build/repo/_site
2:58:50 PM: publishOrigin: ui
2:58:51 PM: Failed during stage 'building site': Build script returned non-zero exit code: 2 (https://ntl.fyi/exit-code-2)
2:58:51 PM: Build failed due to a user error: Build script returned non-zero exit code: 2
2:58:51 PM: Failing build: Failed to build site
2:58:51 PM: Finished processing build request in 1m32.625s

Deploying

Skipped
There is no log for this section

Cleanup

Skipped
There is no log for this section

Post-processing

Skipped
There is no log for this section