Skip to main content

Deploy details

Your deploy failed due to an error

Deploy failed for hugo-theme-stack

Navobel settings

PR #1125: navobel_settings@b36cae5

Deploy log

Initializing

Complete
10:42:10 AM: Build ready to start
10:42:22 AM: build-image version: 9c9fb6952e50bb092d4b66daf2368677e5c68e34 (focal)
10:42:22 AM: buildbot version: 9c9fb6952e50bb092d4b66daf2368677e5c68e34
10:42:22 AM: Fetching cached dependencies
10:42:23 AM: Failed to fetch cache, continuing with build
10:42:23 AM: Starting to prepare the repo for build
10:42:23 AM: No cached dependencies found. Cloning fresh repo
10:42:23 AM: git clone --filter=blob:none https://github.com/CaiJimmy/hugo-theme-stack
10:42:23 AM: Preparing Git Reference pull/1125/head
10:42:24 AM: Custom publish path detected. Proceeding with the specified path: 'exampleSite/public'
10:42:24 AM: Custom build command detected. Proceeding with the specified command: 'cd exampleSite && hugo --gc --themesDir ../.. -b ${DEPLOY_PRIME_URL}'
10:42:25 AM: Starting to install dependencies
10:42:26 AM: mise python@3.13.2 install
10:42:26 AM: mise python@3.13.2 download cpython-3.13.2+20250212-x86_64-unknown-linux-gnu-install_only_stripped.tar.gz
10:42:26 AM: mise python@3.13.2 extract cpython-3.13.2+20250212-x86_64-unknown-linux-gnu-install_only_stripped.tar.gz
10:42:27 AM: mise python@3.13.2 python --version
10:42:27 AM: mise python@3.13.2 Python 3.13.2
10:42:27 AM: mise python@3.13.2 installed
10:42:27 AM: Python version set to 3.13
10:42:29 AM: Collecting pipenv
10:42:29 AM: Downloading pipenv-2024.4.1-py3-none-any.whl.metadata (17 kB)
10:42:29 AM: Collecting certifi (from pipenv)
10:42:29 AM: Downloading certifi-2025.1.31-py3-none-any.whl.metadata (2.5 kB)
10:42:29 AM: Collecting packaging>=22 (from pipenv)
10:42:29 AM: Downloading packaging-24.2-py3-none-any.whl.metadata (3.2 kB)
10:42:29 AM: Collecting setuptools>=67 (from pipenv)
10:42:29 AM: Downloading setuptools-75.8.0-py3-none-any.whl.metadata (6.7 kB)
10:42:29 AM: Collecting virtualenv>=20.24.2 (from pipenv)
10:42:29 AM: Downloading virtualenv-20.29.2-py3-none-any.whl.metadata (4.5 kB)
10:42:29 AM: Collecting distlib<1,>=0.3.7 (from virtualenv>=20.24.2->pipenv)
10:42:29 AM: Downloading distlib-0.3.9-py2.py3-none-any.whl.metadata (5.2 kB)
10:42:29 AM: Collecting filelock<4,>=3.12.2 (from virtualenv>=20.24.2->pipenv)
10:42:29 AM: Downloading filelock-3.17.0-py3-none-any.whl.metadata (2.9 kB)
10:42:29 AM: Collecting platformdirs<5,>=3.9.1 (from virtualenv>=20.24.2->pipenv)
10:42:29 AM: Downloading platformdirs-4.3.6-py3-none-any.whl.metadata (11 kB)
10:42:29 AM: Downloading pipenv-2024.4.1-py3-none-any.whl (3.0 MB)
10:42:29 AM: ━━━━━━━━━━━━━━━━━━━━━━━━━━━━━━━━━━━━━━━━ 3.0/3.0 MB 54.9 MB/s eta 0:00:00
10:42:29 AM: Downloading packaging-24.2-py3-none-any.whl (65 kB)
10:42:29 AM: Downloading setuptools-75.8.0-py3-none-any.whl (1.2 MB)
10:42:29 AM: ━━━━━━━━━━━━━━━━━━━━━━━━━━━━━━━━━━━━━━━━ 1.2/1.2 MB 64.6 MB/s eta 0:00:00
10:42:29 AM: Downloading virtualenv-20.29.2-py3-none-any.whl (4.3 MB)
10:42:29 AM: ━━━━━━━━━━━━━━━━━━━━━━━━━━━━━━━━━━━━━━━━ 4.3/4.3 MB 163.1 MB/s eta 0:00:00
10:42:29 AM: Downloading certifi-2025.1.31-py3-none-any.whl (166 kB)
10:42:29 AM: Downloading distlib-0.3.9-py2.py3-none-any.whl (468 kB)
10:42:29 AM: Downloading filelock-3.17.0-py3-none-any.whl (16 kB)
10:42:29 AM: Downloading platformdirs-4.3.6-py3-none-any.whl (18 kB)
10:42:30 AM: Installing collected packages: distlib, setuptools, platformdirs, packaging, filelock, certifi, virtualenv, pipenv
10:42:32 AM: Successfully installed certifi-2025.1.31 distlib-0.3.9 filelock-3.17.0 packaging-24.2 pipenv-2024.4.1 platformdirs-4.3.6 setuptools-75.8.0 virtualenv-20.29.2
10:42:32 AM: [notice] A new release of pip is available: 24.3.1 -> 25.0.1
10:42:32 AM: [notice] To update, run: pip install --upgrade pip
10:42:32 AM: Attempting Ruby version 2.7.1, read from environment
10:42:32 AM: Required ruby-2.7.1 is not installed - installing.
10:42:33 AM: Searching for binary rubies, this might take some time.
10:42:33 AM: Checking requirements for ubuntu.
10:42:33 AM: Requirements installation successful.
10:42:33 AM: ruby-2.7.1 - #configure
10:42:33 AM: ruby-2.7.1 - #download
10:42:33 AM: ruby-2.7.1 - #validate archive
10:42:36 AM: ruby-2.7.1 - #extract
10:42:38 AM: ruby-2.7.1 - #validate binary
10:42:38 AM: ruby-2.7.1 - #setup
10:42:39 AM: ruby-2.7.1 - #gemset created /opt/buildhome/.rvm/gems/ruby-2.7.1@global
10:42:39 AM: ruby-2.7.1 - #importing gemset /opt/buildhome/.rvm/gemsets/global.gems........................................
10:42:39 AM: ruby-2.7.1 - #generating global wrappers........
10:42:39 AM: ruby-2.7.1 - #gemset created /opt/buildhome/.rvm/gems/ruby-2.7.1
10:42:39 AM: ruby-2.7.1 - #importing gemsetfile /opt/buildhome/.rvm/gemsets/default.gems evaluated to empty gem list
10:42:40 AM: ruby-2.7.1 - #generating default wrappers........
10:42:40 AM: Using /opt/buildhome/.rvm/gems/ruby-2.7.1
10:42:40 AM: Using Ruby version 2.7.1
10:42:41 AM: Started restoring cached go cache
10:42:41 AM: Finished restoring cached go cache
10:42:41 AM: Installing Go version 1.14.4 (requested 1.14.4)
10:42:44 AM: go version go1.14.4 linux/amd64
10:42:45 AM: Using PHP version 8.0
10:42:45 AM: Installing Hugo 0.124.0
10:42:46 AM: hugo v0.124.0-629f84e8edfb0b1b743c3942cd039da1d99812b0+extended linux/amd64 BuildDate=2024-03-16T15:44:32Z VendorInfo=gohugoio
10:42:47 AM: Downloading and installing node v18.20.7...
10:42:48 AM: Computing checksum with sha256sum
10:42:48 AM: Checksums matched!
10:42:50 AM: Now using node v18.20.7 (npm v10.8.2)
10:42:50 AM: Enabling Node.js Corepack
10:42:50 AM: Started restoring cached build plugins
10:42:50 AM: Finished restoring cached build plugins
10:42:50 AM: Successfully installed dependencies
10:42:50 AM: Starting build script
10:42:51 AM: Detected 1 framework(s)
10:42:51 AM: "hugo" at version "unknown"
10:42:51 AM: Section completed: initializing

Building

Failed
10:42:53 AM: Netlify Build
10:42:53 AM: ────────────────────────────────────────────────────────────────
10:42:53 AM:
10:42:53 AM: ❯ Version
10:42:53 AM: @netlify/build 29.58.9
10:42:53 AM:
10:42:53 AM: ❯ Flags
10:42:53 AM: accountId: 59026ca2cf321c7359e9d983
10:42:53 AM: baseRelDir: true
10:42:53 AM: buildId: 67bafb82472bdf00089aa8a5
10:42:53 AM: deployId: 67bafb82472bdf00089aa8a7
10:42:53 AM:
10:42:53 AM: ❯ Current directory
10:42:53 AM: /opt/build/repo
10:42:53 AM:
10:42:53 AM: ❯ Config file
10:42:53 AM: /opt/build/repo/netlify.toml
10:42:53 AM:
10:42:53 AM: ❯ Context
10:42:53 AM: deploy-preview
10:42:53 AM:
10:42:53 AM: ❯ Installing plugins
10:42:53 AM: - netlify-plugin-hugo-cache-resources@0.2.1
10:42:54 AM:
10:42:54 AM: ❯ Loading plugins
10:42:54 AM: - netlify-plugin-hugo-cache-resources@0.2.1 from netlify.toml
10:42:55 AM: Checking if resources exist at "exampleSite/resources"
10:42:55 AM: No cache found for resources folder
10:42:55 AM:
10:42:55 AM: build.command from netlify.toml
10:42:55 AM: ────────────────────────────────────────────────────────────────
10:42:55 AM: ​
10:42:55 AM: $ cd exampleSite && hugo --gc --themesDir ../.. -b ${DEPLOY_PRIME_URL}
10:42:55 AM: Start building sites …
10:42:55 AM: hugo v0.124.0-629f84e8edfb0b1b743c3942cd039da1d99812b0+extended linux/amd64 BuildDate=2024-03-16T15:44:32Z VendorInfo=gohugoio
10:42:55 AM: ERROR render of "page" failed: "/opt/build/repo/layouts/_default/baseof.html:4:12": execute of template failed: template: _default/single.html:4:12: executing "_default/single.html" at <partial "head/head.html" .>: error calling partial: "/opt/build/repo/layouts/partials/head/head.html:28:3": execute of template failed: template: partials/head/head.html:28:3: executing "partials/head/head.html" at <partial "leaflet-loader" .>: error calling partial: partial "leaflet-loader" not found
10:42:55 AM: ERROR render of "term" failed: "/opt/build/repo/layouts/_default/baseof.html:4:12": execute of template failed: template: _default/list.html:4:12: executing "_default/list.html" at <partial "head/head.html" .>: error calling partial: "/opt/build/repo/layouts/partials/head/head.html:28:3": execute of template failed: template: partials/head/head.html:28:3: executing "partials/head/head.html" at <partial "leaflet-loader" .>: error calling partial: partial "leaflet-loader" not found
10:42:55 AM: ERROR render of "section" failed: "/opt/build/repo/layouts/_default/baseof.html:4:12": execute of template failed: template: _default/list.html:4:12: executing "_default/list.html" at <partial "head/head.html" .>: error calling partial: "/opt/build/repo/layouts/partials/head/head.html:28:3": execute of template failed: template: partials/head/head.html:28:3: executing "partials/head/head.html" at <partial "leaflet-loader" .>: error calling partial: partial "leaflet-loader" not found
10:42:55 AM: Total in 193 ms
10:42:55 AM: Error: error building site: render: failed to render pages: render of "term" failed: "/opt/build/repo/layouts/_default/baseof.html:4:12": execute of template failed: template: _default/list.html:4:12: executing "_default/list.html" at <partial "head/head.html" .>: error calling partial: "/opt/build/repo/layouts/partials/head/head.html:28:3": execute of template failed: template: partials/head/head.html:28:3: executing "partials/head/head.html" at <partial "leaflet-loader" .>: error calling partial: partial "leaflet-loader" not found
10:42:55 AM:
10:42:55 AM: "build.command" failed
10:42:55 AM: ────────────────────────────────────────────────────────────────
10:42:55 AM: ​
10:42:55 AM: Error message
10:42:55 AM: Command failed with exit code 1: cd exampleSite && hugo --gc --themesDir ../.. -b ${DEPLOY_PRIME_URL} (https://ntl.fyi/exit-code-1)
10:42:55 AM: ​
10:42:55 AM: Error location
10:42:55 AM: In build.command from netlify.toml:
10:42:55 AM: cd exampleSite && hugo --gc --themesDir ../.. -b ${DEPLOY_PRIME_URL}
10:42:55 AM: ​
10:42:55 AM: Resolved config
10:42:55 AM: build:
10:42:55 AM: command: cd exampleSite && hugo --gc --themesDir ../.. -b ${DEPLOY_PRIME_URL}
10:42:55 AM: commandOrigin: config
10:42:55 AM: environment:
10:42:55 AM: - REVIEW_ID
10:42:55 AM: - HUGO_VERSION
10:42:55 AM: - HUGO_THEME
10:42:55 AM: publish: /opt/build/repo/exampleSite/public
10:42:55 AM: publishOrigin: config
10:42:55 AM: plugins:
10:42:55 AM: - inputs:
10:42:55 AM: debug: true
10:42:55 AM: origin: config
10:42:55 AM: package: netlify-plugin-hugo-cache-resources
10:42:56 AM: Failed during stage 'building site': Build script returned non-zero exit code: 2 (https://ntl.fyi/exit-code-2)
10:42:56 AM: Build failed due to a user error: Build script returned non-zero exit code: 2
10:42:56 AM: Failing build: Failed to build site
10:42:56 AM: Finished processing build request in 33.892s

Deploying

Skipped
There is no log for this section

Cleanup

Skipped
There is no log for this section

Post-processing

Skipped
There is no log for this section