Skip to main content

Deploy details

Your deploy failed due to an error

Deploy failed for kleros-v2-university

feat: jurors page

PR #1840: feat(web)/jurors-page@2bb0a19

Deploy log

Initializing

Complete
11:46:08 AM: Build ready to start
11:46:21 AM: build-image version: 6724b7f630462a3bda7629c0c4b9c485399606e3 (focal)
11:46:21 AM: buildbot version: 927e75ede366e8085d4e00cdba5fd6dcec09e3f4
11:46:21 AM: Fetching cached dependencies
11:46:21 AM: Starting to download cache of 1.0GB
11:46:25 AM: Finished downloading cache in 3.684s
11:46:25 AM: Starting to extract cache
11:47:11 AM: Finished extracting cache in 45.956s
11:47:11 AM: Finished fetching cache in 49.742s
11:47:11 AM: Starting to prepare the repo for build
11:47:11 AM: Preparing Git Reference pull/1840/head
11:47:13 AM: Custom functions path detected. Proceeding with the specified path: 'web/netlify/functions'
11:47:13 AM: Starting to install dependencies
11:47:14 AM: Started restoring cached mise cache
11:47:14 AM: Finished restoring cached mise cache
11:47:15 AM: mise python@3.13.1 install
11:47:15 AM: mise python@3.13.1 download cpython-3.13.1+20250115-x86_64-unknown-linux-gnu-install_only_stripped.tar.gz
11:47:15 AM: mise python@3.13.1 extract cpython-3.13.1+20250115-x86_64-unknown-linux-gnu-install_only_stripped.tar.gz
11:47:15 AM: mise python@3.13.1 python --version
11:47:15 AM: mise python@3.13.1 Python 3.13.1
11:47:15 AM: mise python@3.13.1 installed
11:47:15 AM: Python version set to 3.13
11:47:17 AM: Collecting pipenv
11:47:17 AM: Downloading pipenv-2024.4.1-py3-none-any.whl.metadata (17 kB)
11:47:17 AM: Collecting certifi (from pipenv)
11:47:17 AM: Downloading certifi-2024.12.14-py3-none-any.whl.metadata (2.3 kB)
11:47:17 AM: Collecting packaging>=22 (from pipenv)
11:47:17 AM: Downloading packaging-24.2-py3-none-any.whl.metadata (3.2 kB)
11:47:17 AM: Collecting setuptools>=67 (from pipenv)
11:47:17 AM: Downloading setuptools-75.8.0-py3-none-any.whl.metadata (6.7 kB)
11:47:17 AM: Collecting virtualenv>=20.24.2 (from pipenv)
11:47:17 AM: Downloading virtualenv-20.29.1-py3-none-any.whl.metadata (4.5 kB)
11:47:17 AM: Collecting distlib<1,>=0.3.7 (from virtualenv>=20.24.2->pipenv)
11:47:17 AM: Downloading distlib-0.3.9-py2.py3-none-any.whl.metadata (5.2 kB)
11:47:17 AM: Collecting filelock<4,>=3.12.2 (from virtualenv>=20.24.2->pipenv)
11:47:17 AM: Downloading filelock-3.17.0-py3-none-any.whl.metadata (2.9 kB)
11:47:17 AM: Collecting platformdirs<5,>=3.9.1 (from virtualenv>=20.24.2->pipenv)
11:47:17 AM: Downloading platformdirs-4.3.6-py3-none-any.whl.metadata (11 kB)
11:47:17 AM: Downloading pipenv-2024.4.1-py3-none-any.whl (3.0 MB)
11:47:17 AM: ━━━━━━━━━━━━━━━━━━━━━━━━━━━━━━━━━━━━━━━━ 3.0/3.0 MB 62.8 MB/s eta 0:00:00
11:47:17 AM: Downloading packaging-24.2-py3-none-any.whl (65 kB)
11:47:17 AM: Downloading setuptools-75.8.0-py3-none-any.whl (1.2 MB)
11:47:17 AM: ━━━━━━━━━━━━━━━━━━━━━━━━━━━━━━━━━━━━━━━━ 1.2/1.2 MB 67.1 MB/s eta 0:00:00
11:47:17 AM: Downloading virtualenv-20.29.1-py3-none-any.whl (4.3 MB)
11:47:17 AM: ━━━━━━━━━━━━━━━━━━━━━━━━━━━━━━━━━━━━━━━━ 4.3/4.3 MB 151.1 MB/s eta 0:00:00
11:47:17 AM: Downloading certifi-2024.12.14-py3-none-any.whl (164 kB)
11:47:17 AM: Downloading distlib-0.3.9-py2.py3-none-any.whl (468 kB)
11:47:17 AM: Downloading filelock-3.17.0-py3-none-any.whl (16 kB)
11:47:17 AM: Downloading platformdirs-4.3.6-py3-none-any.whl (18 kB)
11:47:17 AM: Installing collected packages: distlib, setuptools, platformdirs, packaging, filelock, certifi, virtualenv, pipenv
11:47:19 AM: Successfully installed certifi-2024.12.14 distlib-0.3.9 filelock-3.17.0 packaging-24.2 pipenv-2024.4.1 platformdirs-4.3.6 setuptools-75.8.0 virtualenv-20.29.1
11:47:19 AM: [notice] A new release of pip is available: 24.3.1 -> 25.0
11:47:19 AM: [notice] To update, run: pip install --upgrade pip
11:47:20 AM: Attempting Ruby version 2.7.2, read from environment
11:47:20 AM: Using Ruby version 2.7.2
11:47:21 AM: Started restoring cached go cache
11:47:21 AM: Finished restoring cached go cache
11:47:22 AM: go version go1.19.13 linux/amd64
11:47:23 AM: Using PHP version 8.0
11:47:24 AM: Started restoring cached Node.js version
11:47:26 AM: Finished restoring cached Node.js version
11:47:26 AM: Attempting Node.js version '20' from .nvmrc
11:47:27 AM: v20.18.2 is already installed.
11:47:27 AM: Now using node v20.18.2 (npm v10.8.2)
11:47:27 AM: Enabling Node.js Corepack
11:47:27 AM: Started restoring cached build plugins
11:47:27 AM: Finished restoring cached build plugins
11:47:27 AM: Started restoring cached corepack dependencies
11:47:27 AM: Finished restoring cached corepack dependencies
11:47:27 AM: Started restoring cached yarn cache
11:47:27 AM: Finished restoring cached yarn cache
11:47:27 AM: ! Corepack is about to download https://repo.yarnpkg.com/4.6.0/packages/yarnpkg-cli/bin/yarn.js
11:47:28 AM: Installing Yarn version 1.22.19
11:47:28 AM: Preparing yarn@1.22.19 for immediate activation...
11:47:28 AM: yarn workspaces detected
11:47:28 AM: Started restoring workspace contracts node modules
11:47:28 AM: Finished restoring workspace contracts node modules
11:47:28 AM: Started restoring workspace kleros-sdk node modules
11:47:28 AM: Finished restoring workspace kleros-sdk node modules
11:47:28 AM: Started restoring workspace web node modules
11:47:28 AM: Finished restoring workspace web node modules
11:47:28 AM: Started restoring workspace root node modules
11:47:28 AM: Finished restoring workspace root node modules
11:47:28 AM: Installing npm packages using Yarn version 4.6.0
11:47:29 AM: ➤ YN0000: · Yarn 4.6.0
11:47:29 AM: ➤ YN0000: ┌ Resolution step
11:47:30 AM: ➤ YN0000: └ Completed in 0s 414ms
11:47:30 AM: ➤ YN0000: ┌ Post-resolution validation
11:47:30 AM: ➤ YN0060: │ eslint is listed by your project with version 9.15.0 (pda8a7), which doesn't satisfy what eslint-plugin-react-hooks and other dependencies request (but they have non-overlapping ranges!).
➤ YN0060: │ hardhat-deploy is listed by your project with version 0.14.0 (p0216c), which doesn't satisfy what hardhat-deploy-ethers and other dependencies request (~0.12.0).
➤ YN0060: │ react is listed by your project with version 18.3.1 (p6f2bc), which doesn't satisfy what react-identicons and other dependencies request (but they have non-overlapping ranges!).
➤ YN0060: │ react-dom is listed by your project with version 18.3.1 (pca8b0), which doesn't satisfy what react-identicons and other dependencies request (but they have non-overlapping ranges!).
➤ YN0060: │ typescript is listed by your project with version 5.6.3 (pde6dc), which doesn't satisfy what react-scripts and other dependencies request (but they have non-overlapping ranges!).
➤ YN0086: │ Some peer dependencies are incorrectly met by your project; run yarn explain peer-requirements <hash> for details, where <hash> is the six-letter p-prefixed code.
11:47:30 AM: ➤ YN0086: │ Some peer dependencies are incorrectly met by dependencies; run yarn explain peer-requirements for details.
11:47:30 AM: ➤ YN0000: └ Completed
11:47:30 AM: ➤ YN0000: ┌ Fetch step
11:47:40 AM: ➤ YN0000: │ /tmp/xfs-c692f71d STDOUT Packing @zksync/contracts@https://github.com/matter-labs/era-contracts.git#commit=446d391d34bdb48255d5f8fef8a8248925fc98b9 from sources
11:47:40 AM: ➤ YN0000: │ /tmp/xfs-c692f71d STDOUT Using Yarn Classic for bootstrap. Reason: "__metadata" key not found in yarn.lock, must be a Yarn classic lockfile
11:47:40 AM: ➤ YN0000: │ /tmp/xfs-c692f71d STDOUT
11:47:41 AM: ➤ YN0000: │ /tmp/xfs-c692f71d STDOUT ➤ YN0000: Downloading https://classic.yarnpkg.com/latest.js
11:47:41 AM: ➤ YN0000: │ /tmp/xfs-c692f71d STDOUT ➤ YN0000: Saving the new release in .yarn/releases/yarn-classic.cjs
11:47:41 AM: ➤ YN0000: │ /tmp/xfs-c692f71d STDOUT ➤ YN0000: Done in 0s 573ms
11:47:41 AM: ➤ YN0000: │ /tmp/xfs-c692f71d STDOUT
11:47:42 AM: ➤ YN0000: │ /tmp/xfs-c692f71d STDOUT yarn install v1.22.22
11:47:42 AM: ➤ YN0000: │ /tmp/xfs-c692f71d STDOUT [1/4] Resolving packages...
11:47:42 AM: ➤ YN0000: │ /tmp/xfs-c692f71d STDOUT [2/4] Fetching packages...
11:47:43 AM: ➤ YN0000: │ /tmp/xfs-c692f71d STDOUT [3/4] Linking dependencies...
11:47:43 AM: ➤ YN0000: │ /tmp/xfs-c692f71d STDERR warning "@typescript-eslint/eslint-plugin > ts-api-utils@1.3.0" has unmet peer dependency "typescript@>=4.2.0".
11:47:43 AM: ➤ YN0000: │ /tmp/xfs-c692f71d STDERR warning "workspace-aggregator-73dbc0bb-5ac3-4d2a-9550-88fef7397289 > l1-contracts > solhint-plugin-prettier@0.0.5" has incorrect peer dependency "prettier@^1.15.0 || ^2.0.0".
11:47:43 AM: ➤ YN0000: │ /tmp/xfs-c692f71d STDERR warning "workspace-aggregator-73dbc0bb-5ac3-4d2a-9550-88fef7397289 > l1-contracts > @nomiclabs/hardhat-waffle@2.0.6" has unmet peer dependency "@types/sinon-chai@^3.2.3".
11:47:43 AM: ➤ YN0000: │ /tmp/xfs-c692f71d STDERR warning "workspace-aggregator-73dbc0bb-5ac3-4d2a-9550-88fef7397289 > l1-contracts > @typechain/ethers-v5@2.0.0" has incorrect peer dependency "typechain@^3.0.0".
11:47:43 AM: ➤ YN0000: │ /tmp/xfs-c692f71d STDERR warning "workspace-aggregator-73dbc0bb-5ac3-4d2a-9550-88fef7397289 > l1-contracts > ts-node@10.9.2" has unmet peer dependency "@types/node@*".
11:47:43 AM: ➤ YN0000: │ /tmp/xfs-c692f71d STDERR warning "workspace-aggregator-73dbc0bb-5ac3-4d2a-9550-88fef7397289 > l2-contracts > @matterlabs/hardhat-zksync-deploy@0.6.6" has incorrect peer dependency "zksync-web3@^0.14.3".
11:47:43 AM: ➤ YN0000: │ /tmp/xfs-c692f71d STDERR warning "workspace-aggregator-73dbc0bb-5ac3-4d2a-9550-88fef7397289 > l2-contracts > @nomicfoundation/hardhat-ethers@3.0.5" has incorrect peer dependency "ethers@^6.1.0".
11:47:43 AM: ➤ YN0000: │ /tmp/xfs-c692f71d STDERR warning "workspace-aggregator-73dbc0bb-5ac3-4d2a-9550-88fef7397289 > system-contracts > @matterlabs/hardhat-zksync-verify@1.4.3" has unmet peer dependency "@nomicfoundation/hardhat-verify@^2.0.0".
11:47:43 AM: ➤ YN0000: │ /tmp/xfs-c692f71d STDERR warning "workspace-aggregator-73dbc0bb-5ac3-4d2a-9550-88fef7397289 > gas-bound-caller > @matterlabs/zksync-contracts@0.6.1" has unmet peer dependency "@openzeppelin/contracts@4.6.0".
11:47:43 AM: ➤ YN0000: │ /tmp/xfs-c692f71d STDERR warning "workspace-aggregator-73dbc0bb-5ac3-4d2a-9550-88fef7397289 > gas-bound-caller > @matterlabs/zksync-contracts@0.6.1" has unmet peer dependency "@openzeppelin/contracts-upgradeable@4.6.0".
11:47:43 AM: ➤ YN0000: │ /tmp/xfs-c692f71d STDERR warning "workspace-aggregator-73dbc0bb-5ac3-4d2a-9550-88fef7397289 > gas-bound-caller > @matterlabs/hardhat-zksync-verify@0.6.1" has unmet peer dependency "@nomicfoundation/hardhat-verify@^2.0.0".
11:47:43 AM: ➤ YN0000: │ /tmp/xfs-c692f71d STDERR warning "workspace-aggregator-73dbc0bb-5ac3-4d2a-9550-88fef7397289 > l1-contracts > ethereum-waffle > @ethereum-waffle/compiler > @typechain/ethers-v5@10.2.1" has unmet peer dependency "@ethersproject/abi@^5.0.0".
11:47:43 AM: ➤ YN0000: │ /tmp/xfs-c692f71d STDERR warning "workspace-aggregator-73dbc0bb-5ac3-4d2a-9550-88fef7397289 > l1-contracts > ethereum-waffle > @ethereum-waffle/compiler > @typechain/ethers-v5@10.2.1" has unmet peer dependency "@ethersproject/providers@^5.0.0".
11:47:43 AM: ➤ YN0000: │ /tmp/xfs-c692f71d STDERR warning "workspace-aggregator-73dbc0bb-5ac3-4d2a-9550-88fef7397289 > l1-contracts > ethereum-waffle > @ethereum-waffle/provider > @ethereum-waffle/ens@4.0.3" has unmet peer dependency "@ensdomains/ens@^0.4.4".
11:47:43 AM: ➤ YN0000: │ /tmp/xfs-c692f71d STDERR warning "workspace-aggregator-73dbc0bb-5ac3-4d2a-9550-88fef7397289 > l1-contracts > ethereum-waffle > @ethereum-waffle/provider > @ethereum-waffle/ens@4.0.3" has unmet peer dependency "@ensdomains/resolver@^0.2.4".
11:47:59 AM: ➤ YN0000: │ /tmp/xfs-c692f71d STDOUT [4/4] Building fresh packages...
11:48:01 AM: ➤ YN0000: │ /tmp/xfs-c692f71d STDOUT Done in 19.63s.
11:48:02 AM: ➤ YN0000: │ /tmp/xfs-c692f71d STDOUT
11:48:02 AM: ➤ YN0000: │ /tmp/xfs-c692f71d STDOUT yarn pack v1.22.22
11:48:02 AM: ➤ YN0000: │ /tmp/xfs-c692f71d STDOUT success Wrote tarball to "/tmp/xfs-c692f71d/package.tgz".
11:48:02 AM: ➤ YN0000: │ /tmp/xfs-c692f71d STDOUT Done in 0.32s.
11:48:04 AM: ➤ YN0013: │ 3211 packages were added to the project (+ 419.82 MiB).
11:48:04 AM: ➤ YN0000: └ Completed in 34s 356ms
11:48:04 AM: ➤ YN0000: ┌ Link step
11:48:21 AM: ➤ YN0007: │ kleros-v2@workspace:. must be built because it never has been before or the last one failed
11:48:21 AM: ➤ YN0007: │ esbuild@npm:0.21.5 must be built because it never has been before or the last one failed
11:48:21 AM: ➤ YN0007: │ core-js@npm:3.39.0 must be built because it never has been before or the last one failed
11:48:21 AM: ➤ YN0007: │ bufferutil@npm:4.0.8 must be built because it never has been before or the last one failed
11:48:21 AM: ➤ YN0007: │ utf-8-validate@npm:5.0.10 must be built because it never has been before or the last one failed
11:48:21 AM: ➤ YN0007: │ @arbitrum/nitro-contracts@npm:1.1.1 must be built because it never has been before or the last one failed
11:48:21 AM: ➤ YN0007: │ @arbitrum/nitro-contracts@npm:1.3.0 must be built because it never has been before or the last one failed
11:48:21 AM: ➤ YN0007: │ keccak@npm:3.0.4 must be built because it never has been before or the last one failed
11:48:21 AM: ➤ YN0007: │ secp256k1@npm:4.0.4 must be built because it never has been before or the last one failed
11:48:21 AM: ➤ YN0007: │ esbuild@npm:0.19.12 must be built because it never has been before or the last one failed
11:48:21 AM: ➤ YN0007: │ bigint-buffer@npm:1.1.5 must be built because it never has been before or the last one failed
11:48:21 AM: ➤ YN0007: │ core-js-pure@npm:3.31.0 must be built because it never has been before or the last one failed
11:48:21 AM: ➤ YN0007: │ @fortawesome/fontawesome-common-types@npm:6.5.1 must be built because it never has been before or the last one failed
11:48:21 AM: ➤ YN0007: │ canvas@npm:2.11.2 must be built because it never has been before or the last one failed
11:48:22 AM: ➤ YN0000: │ @fortawesome/fontawesome-common-types@npm:6.5.1 STDOUT Font Awesome Free 6.5.1 by @fontawesome - https://fontawesome.com
11:48:22 AM: ➤ YN0000: │ @fortawesome/fontawesome-common-types@npm:6.5.1 STDOUT License - https://fontawesome.com/license/free (Icons: CC BY 4.0, Fonts: SIL OFL 1.1, Code: MIT License)
11:48:22 AM: ➤ YN0000: │ @fortawesome/fontawesome-common-types@npm:6.5.1 STDOUT Copyright 2023 Fonticons, Inc.
11:48:22 AM: ➤ YN0000: │ @fortawesome/fontawesome-common-types@npm:6.5.1 STDOUT
11:48:22 AM: ➤ YN0000: │ kleros-v2@workspace:. STDERR error: volta not installed
11:48:22 AM: ➤ YN0000: │ kleros-v2@workspace:. STDERR error: docker not installed
11:48:22 AM: ➤ YN0000: │ kleros-v2@workspace:. STDERR error: docker-compose not installed
11:48:22 AM: ➤ YN0000: │ kleros-v2@workspace:. STDERR error: cast not installed
11:48:22 AM: ➤ YN0000: │ kleros-v2@workspace:. STDERR error: forge not installed
11:48:22 AM: ➤ YN0000: │ kleros-v2@workspace:. STDERR error: yq not installed
11:48:22 AM: ➤ YN0000: │ kleros-v2@workspace:. STDERR error: act not installed
11:48:23 AM: ➤ YN0000: │ kleros-v2@workspace:. STDOUT husky - Git hooks installed
11:48:23 AM: ➤ YN0000: │ @arbitrum/nitro-contracts@npm:1.3.0 STDOUT patch-package 6.5.1
11:48:23 AM: ➤ YN0000: │ @arbitrum/nitro-contracts@npm:1.3.0 STDOUT Applying patches...
11:48:23 AM: ➤ YN0000: │ @arbitrum/nitro-contracts@npm:1.3.0 STDERR No patch files found
11:48:23 AM: ➤ YN0000: │ @arbitrum/nitro-contracts@npm:1.1.1 STDOUT patch-package 6.5.1
11:48:23 AM: ➤ YN0000: │ @arbitrum/nitro-contracts@npm:1.1.1 STDOUT Applying patches...
11:48:23 AM: ➤ YN0000: │ @arbitrum/nitro-contracts@npm:1.1.1 STDERR No patch files found
11:48:23 AM: ➤ YN0000: │ canvas@npm:2.11.2 STDERR node-pre-gyp info it worked if it ends with ok
11:48:23 AM: ➤ YN0000: │ canvas@npm:2.11.2 STDERR node-pre-gyp info using node-pre-gyp@1.0.11
11:48:23 AM: ➤ YN0000: │ canvas@npm:2.11.2 STDERR node-pre-gyp info using node@20.18.2 | linux | x64
11:48:23 AM: ➤ YN0000: │ bigint-buffer@npm:1.1.5 STDOUT
11:48:23 AM: ➤ YN0000: │ bigint-buffer@npm:1.1.5 STDOUT > bigint-buffer@1.1.5 rebuild
11:48:23 AM: ➤ YN0000: │ bigint-buffer@npm:1.1.5 STDOUT > node-gyp rebuild
11:48:23 AM: ➤ YN0000: │ bigint-buffer@npm:1.1.5 STDOUT
11:48:23 AM: ➤ YN0000: │ bigint-buffer@npm:1.1.5 STDERR gyp info it worked if it ends with ok
11:48:23 AM: ➤ YN0000: │ bigint-buffer@npm:1.1.5 STDERR gyp info using node-gyp@9.4.0
11:48:23 AM: ➤ YN0000: │ bigint-buffer@npm:1.1.5 STDERR gyp info using node@20.18.2 | linux | x64
11:48:23 AM: ➤ YN0000: │ canvas@npm:2.11.2 STDERR node-pre-gyp info install unpacking Release/
11:48:23 AM: ➤ YN0000: │ canvas@npm:2.11.2 STDERR node-pre-gyp info install unpacking Release/libfontconfig.so.1
11:48:23 AM: ➤ YN0000: │ canvas@npm:2.11.2 STDERR node-pre-gyp info install unpacking Release/libglib-2.0.so.0
11:48:23 AM: ➤ YN0000: │ bigint-buffer@npm:1.1.5 STDERR gyp info find Python using Python version 3.13.1 found at "/opt/buildhome/.local/share/mise/installs/python/3.13.1/bin/python3"
11:48:23 AM: ➤ YN0000: │ canvas@npm:2.11.2 STDERR node-pre-gyp info install unpacking Release/libgmodule-2.0.so.0
11:48:23 AM: ➤ YN0000: │ canvas@npm:2.11.2 STDERR node-pre-gyp info install unpacking Release/libstdc++.so.6
11:48:23 AM: ➤ YN0000: │ canvas@npm:2.11.2 STDERR node-pre-gyp info install unpacking Release/libz.so.1
11:48:23 AM: ➤ YN0000: │ canvas@npm:2.11.2 STDERR node-pre-gyp info install unpacking Release/canvas.node
11:48:23 AM: ➤ YN0000: │ canvas@npm:2.11.2 STDERR node-pre-gyp info install unpacking Release/obj.target/
11:48:23 AM: ➤ YN0000: │ canvas@npm:2.11.2 STDERR node-pre-gyp info install unpacking Release/obj.target/canvas.node
11:48:23 AM: ➤ YN0000: │ canvas@npm:2.11.2 STDERR node-pre-gyp info install unpacking Release/obj.target/canvas/
11:48:23 AM: ➤ YN0000: │ canvas@npm:2.11.2 STDERR node-pre-gyp info install unpacking Release/obj.target/canvas/src/
11:48:23 AM: ➤ YN0000: │ canvas@npm:2.11.2 STDERR node-pre-gyp info install unpacking Release/obj.target/canvas/src/init.o
11:48:23 AM: ➤ YN0000: │ canvas@npm:2.11.2 STDERR node-pre-gyp info install unpacking Release/obj.target/canvas/src/closure.o
11:48:23 AM: ➤ YN0000: │ canvas@npm:2.11.2 STDERR node-pre-gyp info install unpacking Release/obj.target/canvas/src/backend/
11:48:23 AM: ➤ YN0000: │ canvas@npm:2.11.2 STDERR node-pre-gyp info install unpacking Release/obj.target/canvas/src/backend/Backend.o
11:48:23 AM: ➤ YN0000: │ canvas@npm:2.11.2 STDERR node-pre-gyp info install unpacking Release/obj.target/canvas/src/backend/PdfBackend.o
11:48:23 AM: ➤ YN0000: │ canvas@npm:2.11.2 STDERR node-pre-gyp info install unpacking Release/obj.target/canvas/src/backend/ImageBackend.o
11:48:23 AM: ➤ YN0000: │ canvas@npm:2.11.2 STDERR node-pre-gyp info install unpacking Release/obj.target/canvas/src/backend/SvgBackend.o
11:48:23 AM: ➤ YN0000: │ canvas@npm:2.11.2 STDERR node-pre-gyp info install unpacking Release/obj.target/canvas/src/ImageData.o
11:48:23 AM: ➤ YN0000: │ canvas@npm:2.11.2 STDERR node-pre-gyp info install unpacking Release/obj.target/canvas/src/bmp/
11:48:23 AM: ➤ YN0000: │ canvas@npm:2.11.2 STDERR node-pre-gyp info install unpacking Release/obj.target/canvas/src/bmp/BMPParser.o
11:48:23 AM: ➤ YN0000: │ canvas@npm:2.11.2 STDERR node-pre-gyp info install unpacking Release/obj.target/canvas/src/Image.o
11:48:23 AM: ➤ YN0000: │ canvas@npm:2.11.2 STDERR node-pre-gyp info install unpacking Release/obj.target/canvas/src/CanvasGradient.o
11:48:23 AM: ➤ YN0000: │ canvas@npm:2.11.2 STDERR node-pre-gyp info install unpacking Release/obj.target/canvas/src/Canvas.o
11:48:23 AM: ➤ YN0000: │ canvas@npm:2.11.2 STDERR node-pre-gyp info install unpacking Release/obj.target/canvas/src/color.o
11:48:23 AM: ➤ YN0000: │ canvas@npm:2.11.2 STDERR node-pre-gyp info install unpacking Release/obj.target/canvas/src/Backends.o
11:48:23 AM: ➤ YN0000: │ canvas@npm:2.11.2 STDERR node-pre-gyp info install unpacking Release/obj.target/canvas/src/CanvasPattern.o
11:48:23 AM: ➤ YN0000: │ canvas@npm:2.11.2 STDERR node-pre-gyp info install unpacking Release/obj.target/canvas/src/CanvasRenderingContext2d.o
11:48:23 AM: ➤ YN0000: │ bigint-buffer@npm:1.1.5 STDERR gyp info spawn /opt/buildhome/.local/share/mise/installs/python/3.13.1/bin/python3
11:48:23 AM: ➤ YN0000: │ bigint-buffer@npm:1.1.5 STDERR gyp info spawn args [
11:48:23 AM: ➤ YN0000: │ bigint-buffer@npm:1.1.5 STDERR gyp info spawn args '/opt/build/repo/node_modules/node-gyp/gyp/gyp_main.py',
11:48:23 AM: ➤ YN0000: │ bigint-buffer@npm:1.1.5 STDERR gyp info spawn args 'binding.gyp',
11:48:23 AM: ➤ YN0000: │ bigint-buffer@npm:1.1.5 STDERR gyp info spawn args '-f',
11:48:23 AM: ➤ YN0000: │ bigint-buffer@npm:1.1.5 STDERR gyp info spawn args 'make',
11:48:23 AM: ➤ YN0000: │ bigint-buffer@npm:1.1.5 STDERR gyp info spawn args '-I',
11:48:23 AM: ➤ YN0000: │ bigint-buffer@npm:1.1.5 STDERR gyp info spawn args '/opt/build/repo/node_modules/bigint-buffer/build/config.gypi',
11:48:23 AM: ➤ YN0000: │ bigint-buffer@npm:1.1.5 STDERR gyp info spawn args '-I',
11:48:23 AM: ➤ YN0000: │ bigint-buffer@npm:1.1.5 STDERR gyp info spawn args '/opt/build/repo/node_modules/node-gyp/addon.gypi',
11:48:23 AM: ➤ YN0000: │ bigint-buffer@npm:1.1.5 STDERR gyp info spawn args '-I',
11:48:23 AM: ➤ YN0000: │ bigint-buffer@npm:1.1.5 STDERR gyp info spawn args '/opt/buildhome/.cache/node-gyp/20.18.2/include/node/common.gypi',
11:48:23 AM: ➤ YN0000: │ bigint-buffer@npm:1.1.5 STDERR gyp info spawn args '-Dlibrary=shared_library',
11:48:23 AM: ➤ YN0000: │ bigint-buffer@npm:1.1.5 STDERR gyp info spawn args '-Dvisibility=default',
11:48:23 AM: ➤ YN0000: │ bigint-buffer@npm:1.1.5 STDERR gyp info spawn args '-Dnode_root_dir=/opt/buildhome/.cache/node-gyp/20.18.2',
11:48:23 AM: ➤ YN0000: │ bigint-buffer@npm:1.1.5 STDERR gyp info spawn args '-Dnode_gyp_dir=/opt/build/repo/node_modules/node-gyp',
11:48:23 AM: ➤ YN0000: │ bigint-buffer@npm:1.1.5 STDERR gyp info spawn args '-Dnode_lib_file=/opt/buildhome/.cache/node-gyp/20.18.2/<(target_arch)/node.lib',
11:48:23 AM: ➤ YN0000: │ bigint-buffer@npm:1.1.5 STDERR gyp info spawn args '-Dmodule_root_dir=/opt/build/repo/node_modules/bigint-buffer',
11:48:23 AM: ➤ YN0000: │ bigint-buffer@npm:1.1.5 STDERR gyp info spawn args '-Dnode_engine=v8',
11:48:23 AM: ➤ YN0000: │ bigint-buffer@npm:1.1.5 STDERR gyp info spawn args '--depth=.',
11:48:23 AM: ➤ YN0000: │ bigint-buffer@npm:1.1.5 STDERR gyp info spawn args '--no-parallel',
11:48:23 AM: ➤ YN0000: │ bigint-buffer@npm:1.1.5 STDERR gyp info spawn args '--generator-output',
11:48:23 AM: ➤ YN0000: │ bigint-buffer@npm:1.1.5 STDERR gyp info spawn args 'build',
11:48:23 AM: ➤ YN0000: │ bigint-buffer@npm:1.1.5 STDERR gyp info spawn args '-Goutput_dir=.'
11:48:23 AM: ➤ YN0000: │ bigint-buffer@npm:1.1.5 STDERR gyp info spawn args ]
11:48:23 AM: ➤ YN0000: │ canvas@npm:2.11.2 STDERR node-pre-gyp info install unpacking Release/obj.target/canvas/src/register_font.o
11:48:23 AM: ➤ YN0000: │ canvas@npm:2.11.2 STDERR node-pre-gyp info install unpacking Release/libjpeg.so.62
11:48:23 AM: ➤ YN0000: │ canvas@npm:2.11.2 STDERR node-pre-gyp info install unpacking Release/libexpat.so.1
11:48:23 AM: ➤ YN0000: │ canvas@npm:2.11.2 STDERR node-pre-gyp info install unpacking Release/libcairo.so.2
11:48:24 AM: ➤ YN0000: │ canvas@npm:2.11.2 STDERR node-pre-gyp info install unpacking Release/libgobject-2.0.so.0
11:48:24 AM: ➤ YN0000: │ canvas@npm:2.11.2 STDERR node-pre-gyp info install unpacking Release/libxml2.so.2
11:48:24 AM: ➤ YN0000: │ canvas@npm:2.11.2 STDERR node-pre-gyp info install unpacking Release/libpango-1.0.so.0
11:48:24 AM: ➤ YN0000: │ canvas@npm:2.11.2 STDERR node-pre-gyp info install unpacking Release/libpcre.so.1
11:48:24 AM: ➤ YN0000: │ canvas@npm:2.11.2 STDERR node-pre-gyp info install unpacking Release/libpng16.so.16
11:48:24 AM: ➤ YN0000: │ canvas@npm:2.11.2 STDERR node-pre-gyp info install unpacking Release/libfreetype.so.6
11:48:24 AM: ➤ YN0000: │ canvas@npm:2.11.2 STDERR node-pre-gyp info install unpacking Release/libgio-2.0.so.0
11:48:24 AM: ➤ YN0000: │ bigint-buffer@npm:1.1.5 STDERR gyp info spawn make
11:48:24 AM: ➤ YN0000: │ bigint-buffer@npm:1.1.5 STDERR gyp info spawn args [ 'BUILDTYPE=Release', '-C', 'build' ]
11:48:24 AM: ➤ YN0000: │ bigint-buffer@npm:1.1.5 STDOUT make: Entering directory '/opt/build/repo/node_modules/bigint-buffer/build'
11:48:24 AM: ➤ YN0000: │ bigint-buffer@npm:1.1.5 STDOUT CC(target) Release/obj.target/bigint_buffer/src/bigint-buffer.o
11:48:24 AM: ➤ YN0000: │ canvas@npm:2.11.2 STDERR node-pre-gyp info install unpacking Release/libgif.so.7
11:48:24 AM: ➤ YN0000: │ canvas@npm:2.11.2 STDERR node-pre-gyp info install unpacking Release/libpangoft2-1.0.so.0
11:48:24 AM: ➤ YN0000: │ canvas@npm:2.11.2 STDERR node-pre-gyp info install unpacking Release/libffi.so.7
11:48:24 AM: ➤ YN0000: │ canvas@npm:2.11.2 STDERR node-pre-gyp info install unpacking Release/libpangocairo-1.0.so.0
11:48:24 AM: ➤ YN0000: │ canvas@npm:2.11.2 STDERR node-pre-gyp info install unpacking Release/libfribidi.so.0
11:48:24 AM: ➤ YN0000: │ canvas@npm:2.11.2 STDERR node-pre-gyp info install unpacking Release/librsvg-2.so.2
11:48:24 AM: ➤ YN0000: │ bigint-buffer@npm:1.1.5 STDOUT SOLINK_MODULE(target) Release/obj.target/bigint_buffer.node
11:48:24 AM: ➤ YN0000: │ bigint-buffer@npm:1.1.5 STDOUT COPY Release/bigint_buffer.node
11:48:24 AM: ➤ YN0000: │ bigint-buffer@npm:1.1.5 STDOUT make: Leaving directory '/opt/build/repo/node_modules/bigint-buffer/build'
11:48:24 AM: ➤ YN0000: │ bigint-buffer@npm:1.1.5 STDERR gyp info ok
11:48:25 AM: ➤ YN0000: │ canvas@npm:2.11.2 STDERR node-pre-gyp info install unpacking Release/libcairo-gobject.so.2
11:48:25 AM: ➤ YN0000: │ canvas@npm:2.11.2 STDERR node-pre-gyp info install unpacking Release/libharfbuzz.so.0
11:48:25 AM: ➤ YN0000: │ canvas@npm:2.11.2 STDERR node-pre-gyp info install unpacking Release/libpixman-1.so.0
11:48:25 AM: ➤ YN0000: │ canvas@npm:2.11.2 STDERR node-pre-gyp info install unpacking Release/libgdk_pixbuf-2.0.so.0
11:48:25 AM: ➤ YN0000: │ canvas@npm:2.11.2 STDERR node-pre-gyp info install unpacking Release/.deps/
11:48:25 AM: ➤ YN0000: │ canvas@npm:2.11.2 STDERR node-pre-gyp info install unpacking Release/.deps/Release/
11:48:25 AM: ➤ YN0000: │ canvas@npm:2.11.2 STDERR node-pre-gyp info install unpacking Release/.deps/Release/obj.target/
11:48:25 AM: ➤ YN0000: │ canvas@npm:2.11.2 STDERR node-pre-gyp info install unpacking Release/.deps/Release/obj.target/canvas.node.d
11:48:25 AM: ➤ YN0000: │ canvas@npm:2.11.2 STDERR node-pre-gyp info install unpacking Release/.deps/Release/obj.target/canvas/
11:48:25 AM: ➤ YN0000: │ canvas@npm:2.11.2 STDERR node-pre-gyp info install unpacking Release/.deps/Release/obj.target/canvas/src/
11:48:25 AM: ➤ YN0000: │ canvas@npm:2.11.2 STDERR node-pre-gyp info install unpacking Release/.deps/Release/obj.target/canvas/src/color.o.d
11:48:25 AM: ➤ YN0000: │ canvas@npm:2.11.2 STDERR node-pre-gyp info install unpacking Release/.deps/Release/obj.target/canvas/src/backend/
11:48:25 AM: ➤ YN0000: │ canvas@npm:2.11.2 STDERR node-pre-gyp info install unpacking Release/.deps/Release/obj.target/canvas/src/backend/SvgBackend.o.d
11:48:25 AM: ➤ YN0000: │ canvas@npm:2.11.2 STDERR node-pre-gyp info install unpacking Release/.deps/Release/obj.target/canvas/src/backend/PdfBackend.o.d
11:48:25 AM: ➤ YN0000: │ canvas@npm:2.11.2 STDERR node-pre-gyp info install unpacking Release/.deps/Release/obj.target/canvas/src/backend/ImageBackend.o.d
11:48:25 AM: ➤ YN0000: │ canvas@npm:2.11.2 STDERR node-pre-gyp info install unpacking Release/.deps/Release/obj.target/canvas/src/backend/Backend.o.d
11:48:25 AM: ➤ YN0000: │ canvas@npm:2.11.2 STDERR node-pre-gyp info install unpacking Release/.deps/Release/obj.target/canvas/src/CanvasGradient.o.d
11:48:25 AM: ➤ YN0000: │ canvas@npm:2.11.2 STDERR node-pre-gyp info install unpacking Release/.deps/Release/obj.target/canvas/src/Canvas.o.d
11:48:25 AM: ➤ YN0000: │ canvas@npm:2.11.2 STDERR node-pre-gyp info install unpacking Release/.deps/Release/obj.target/canvas/src/bmp/
11:48:25 AM: ➤ YN0000: │ canvas@npm:2.11.2 STDERR node-pre-gyp info install unpacking Release/.deps/Release/obj.target/canvas/src/bmp/BMPParser.o.d
11:48:25 AM: ➤ YN0000: │ canvas@npm:2.11.2 STDERR node-pre-gyp info install unpacking Release/.deps/Release/obj.target/canvas/src/Image.o.d
11:48:25 AM: ➤ YN0000: │ canvas@npm:2.11.2 STDERR node-pre-gyp info install unpacking Release/.deps/Release/obj.target/canvas/src/register_font.o.d
11:48:25 AM: ➤ YN0000: │ canvas@npm:2.11.2 STDERR node-pre-gyp info install unpacking Release/.deps/Release/obj.target/canvas/src/Backends.o.d
11:48:25 AM: ➤ YN0000: │ canvas@npm:2.11.2 STDERR node-pre-gyp info install unpacking Release/.deps/Release/obj.target/canvas/src/CanvasPattern.o.d
11:48:25 AM: ➤ YN0000: │ canvas@npm:2.11.2 STDERR node-pre-gyp info install unpacking Release/.deps/Release/obj.target/canvas/src/CanvasRenderingContext2d.o.d
11:48:25 AM: ➤ YN0000: │ canvas@npm:2.11.2 STDERR node-pre-gyp info install unpacking Release/.deps/Release/obj.target/canvas/src/ImageData.o.d
11:48:25 AM: ➤ YN0000: │ canvas@npm:2.11.2 STDERR node-pre-gyp info extracted file count: 71
11:48:25 AM: ➤ YN0000: │ canvas@npm:2.11.2 STDOUT [canvas] Success: "/opt/build/repo/node_modules/canvas/build/Release/canvas.node" is installed via remote
11:48:25 AM: ➤ YN0000: │ canvas@npm:2.11.2 STDERR node-pre-gyp info ok
11:48:25 AM: ➤ YN0000: │ canvas@npm:2.11.2 STDERR node-pre-gyp info install unpacking Release/.deps/Release/obj.target/canvas/src/init.o.d
11:48:25 AM: ➤ YN0000: │ canvas@npm:2.11.2 STDERR node-pre-gyp info install unpacking Release/.deps/Release/obj.target/canvas/src/closure.o.d
11:48:25 AM: ➤ YN0000: │ canvas@npm:2.11.2 STDERR node-pre-gyp info install unpacking Release/.deps/Release/canvas.node.d
11:48:25 AM: ➤ YN0007: │ @fortawesome/free-regular-svg-icons@npm:6.5.1 must be built because it never has been before or the last one failed
11:48:25 AM: ➤ YN0007: │ @fortawesome/free-solid-svg-icons@npm:6.5.1 must be built because it never has been before or the last one failed
11:48:26 AM: ➤ YN0000: │ @fortawesome/free-regular-svg-icons@npm:6.5.1 STDOUT Font Awesome Free 6.5.1 by @fontawesome - https://fontawesome.com
11:48:26 AM: ➤ YN0000: │ @fortawesome/free-regular-svg-icons@npm:6.5.1 STDOUT License - https://fontawesome.com/license/free (Icons: CC BY 4.0, Fonts: SIL OFL 1.1, Code: MIT License)
11:48:26 AM: ➤ YN0000: │ @fortawesome/free-regular-svg-icons@npm:6.5.1 STDOUT Copyright 2023 Fonticons, Inc.
11:48:26 AM: ➤ YN0000: │ @fortawesome/free-regular-svg-icons@npm:6.5.1 STDOUT
11:48:26 AM: ➤ YN0000: │ @fortawesome/free-solid-svg-icons@npm:6.5.1 STDOUT Font Awesome Free 6.5.1 by @fontawesome - https://fontawesome.com
11:48:26 AM: ➤ YN0000: │ @fortawesome/free-solid-svg-icons@npm:6.5.1 STDOUT License - https://fontawesome.com/license/free (Icons: CC BY 4.0, Fonts: SIL OFL 1.1, Code: MIT License)
11:48:26 AM: ➤ YN0000: │ @fortawesome/free-solid-svg-icons@npm:6.5.1 STDOUT Copyright 2023 Fonticons, Inc.
11:48:26 AM: ➤ YN0000: │ @fortawesome/free-solid-svg-icons@npm:6.5.1 STDOUT
11:48:26 AM: ➤ YN0000: └ Completed in 21s 193ms
11:48:26 AM: ➤ YN0000: · Done with warnings in 56s 468ms
11:48:27 AM: npm packages installed using Yarn
11:48:27 AM: Successfully installed dependencies
11:48:27 AM: Starting build script
11:48:29 AM: Detected 0 framework(s)
11:48:29 AM: Section completed: initializing

Building

Failed
11:48:30 AM: Netlify Build
11:48:30 AM: ────────────────────────────────────────────────────────────────
11:48:30 AM:
11:48:30 AM: ❯ Version
11:48:30 AM: @netlify/build 29.58.8
11:48:30 AM:
11:48:30 AM: ❯ Flags
11:48:30 AM: accountId: 59b713c1cf321c2011ae7423
11:48:30 AM: baseRelDir: true
11:48:30 AM: buildId: 679b65adc7c0230008fe539b
11:48:30 AM: deployId: 679b65adc7c0230008fe539d
11:48:30 AM: packagePath: web
11:48:30 AM:
11:48:30 AM: ❯ Current directory
11:48:30 AM: /opt/build/repo
11:48:30 AM:
11:48:30 AM: ❯ Config file
11:48:30 AM: /opt/build/repo/web/netlify.toml
11:48:30 AM:
11:48:30 AM: ❯ Context
11:48:30 AM: deploy-preview
11:48:30 AM:
11:48:30 AM: Build command from Netlify app
11:48:30 AM: ────────────────────────────────────────────────────────────────
11:48:30 AM: ​
11:48:30 AM: $ yarn build:web:ci
11:48:32 AM: YN0000: · Yarn 4.6.0
11:48:32 AM: YN0000: ┌ Resolution step
11:48:32 AM: YN0085: │ - @chainsafe/is-ip@npm:2.0.1, @chainsafe/netmask@npm:2.0.0, @codemirror/autocomplete@npm:6.12.0, @codemirror/commands@npm:6.3.3, and 424 more.
11:48:32 AM: YN0000: └ Completed in 0s 334ms
11:48:32 AM: YN0000: ┌ Post-resolution validation
11:48:32 AM: YN0060: │ eslint is listed by your project with version 9.15.0 (pda8a7), which doesn't satisfy what eslint-plugin-react-hooks and other dependencies request (but they have non-overlapping ranges!).
11:48:32 AM: YN0060: │ hardhat-deploy is listed by your project with version 0.14.0 (p0216c), which doesn't satisfy what hardhat-deploy-ethers and other dependencies request (~0.12.0).
11:48:32 AM: YN0060: │ react is listed by your project with version 18.3.1 (p6f2bc), which doesn't satisfy what react-identicons and other dependencies request (but they have non-overlapping ranges!).
11:48:32 AM: YN0060: │ react-dom is listed by your project with version 18.3.1 (pca8b0), which doesn't satisfy what react-identicons and other dependencies request (but they have non-overlapping ranges!).
11:48:32 AM: YN0060: │ typescript is listed by your project with version 5.6.3 (pde6dc), which doesn't satisfy what react-scripts and other dependencies request (but they have non-overlapping ranges!).
11:48:32 AM: YN0086: │ Some peer dependencies are incorrectly met by your project; run yarn explain peer-requirements <hash> for details, where <hash> is the six-letter p-prefixed code.
11:48:32 AM: YN0086: │ Some peer dependencies are incorrectly met by dependencies; run yarn explain peer-requirements for details.
11:48:32 AM: YN0000: └ Completed
11:48:32 AM: YN0000: ┌ Fetch step
11:48:33 AM: YN0000: └ Completed in 0s 721ms
11:48:33 AM: YN0000: ┌ Link step
11:48:36 AM: YN0000: └ Completed in 3s 408ms
11:48:36 AM: YN0000: · Done with warnings in 4s 740ms
11:48:42 AM: vite v5.4.11 building for production...
11:48:42 AM: transforming...
11:48:42 AM: 307 modules transformed.
11:48:42 AM: rendering chunks...
11:48:42 AM:
11:48:42 AM: [vite:dts] Start generate declaration files...
11:48:42 AM: computing gzip size...
11:48:42 AM: dist/kleros-app.js 33.69 kB │ gzip: 10.37 kB │ map: 126.35 kB
11:48:42 AM: [vite:dts] Declaration files built in 2060ms.
11:48:42 AM:
11:48:42 AM: dist/kleros-app.umd.cjs 25.58 kB │ gzip: 9.46 kB │ map: 124.22 kB
11:48:42 AM: ✓ built in 2.65s
11:48:42 AM: No name was provided for external module "wagmi" in "output.globals" – guessing "wagmi".
11:48:42 AM: No name was provided for external module "graphql" in "output.globals" – guessing "graphql".
11:48:56 AM: Downloading compiler 0.8.24
11:48:56 AM: Generating typings for: 137 artifacts in dir: typechain-types for target: ethers-v6
11:48:56 AM: Successfully generated 398 typings!
11:48:56 AM: Compiled 108 Solidity files successfully (evm target: paris).
11:48:56 AM: Warning: Failure condition of 'send' ignored. Consider using 'transfer' instead.
11:48:56 AM: --> src/arbitration/KlerosCoreBase.sol:804:17:
11:48:56 AM: |
11:48:56 AM: 804 | payable(governor).send(round.totalFeesForJurors);
11:48:56 AM: | ^^^^^^^^^^^^^^^^^^^^^^^^^^^^^^^^^^^^^^^^^^^^^^^^
11:48:56 AM: Warning: Failure condition of 'send' ignored. Consider using 'transfer' instead.
11:48:56 AM: --> src/arbitration/KlerosCoreBase.sol:861:13:
11:48:56 AM: |
11:48:56 AM: 861 | payable(account).send(feeReward);
11:48:56 AM: | ^^^^^^^^^^^^^^^^^^^^^^^^^^^^^^^^
11:48:56 AM: Warning: Failure condition of 'send' ignored. Consider using 'transfer' instead.
11:48:56 AM: --> src/arbitration/KlerosCoreBase.sol:887:25:
11:48:56 AM: |
11:48:56 AM: 887 | payable(governor).send(leftoverFeeReward);
11:48:56 AM: | ^^^^^^^^^^^^^^^^^^^^^^^^^^^^^^^^^^^^^^^^^
11:48:56 AM: Warning: Failure condition of 'send' ignored. Consider using 'transfer' instead.
11:48:56 AM: --> src/arbitration/KlerosGovernor.sol:245:28:
11:48:56 AM: |
11:48:56 AM: 245 | if (remainder > 0) payable(msg.sender).send(remainder);
11:48:56 AM: | ^^^^^^^^^^^^^^^^^^^^^^^^^^^^^^^^^^^
11:48:56 AM: Warning: Failure condition of 'send' ignored. Consider using 'transfer' instead.
11:48:56 AM: --> src/arbitration/KlerosGovernor.sol:285:13:
11:48:56 AM: |
11:48:56 AM: 285 | submission.submitter.send(sumDeposit);
11:48:56 AM: | ^^^^^^^^^^^^^^^^^^^^^^^^^^^^^^^^^^^^^
11:48:56 AM: Warning: Failure condition of 'send' ignored. Consider using 'transfer' instead.
11:48:56 AM: --> src/arbitration/KlerosGovernor.sol:319:13:
11:48:56 AM: |
11:48:56 AM: 319 | submission.submitter.send(session.sumDeposit);
11:48:56 AM: | ^^^^^^^^^^^^^^^^^^^^^^^^^^^^^^^^^^^^^^^^^^^^^
11:48:56 AM: Warning: Failure condition of 'send' ignored. Consider using 'transfer' instead.
11:48:56 AM: --> src/arbitration/devtools/KlerosCoreRuler.sol:524:13:
11:48:56 AM: |
11:48:56 AM: 524 | payable(account).send(feeReward);
11:48:56 AM: | ^^^^^^^^^^^^^^^^^^^^^^^^^^^^^^^^
11:48:56 AM: Warning: Failure condition of 'send' ignored. Consider using 'transfer' instead.
11:48:56 AM: --> src/arbitration/dispute-kits/DisputeKitClassicBase.sol:391:39:
11:48:56 AM: |
11:48:56 AM: 391 | if (msg.value > contribution) payable(msg.sender).send(msg.value - contribution);
11:48:56 AM: | ^^^^^^^^^^^^^^^^^^^^^^^^^^^^^^^^^^^^^^^^^^^^^^^^^^
11:48:56 AM: Warning: Failure condition of 'send' ignored. Consider using 'transfer' instead.
11:48:56 AM: --> src/arbitration/dispute-kits/DisputeKitClassicBase.sol:435:13:
11:48:56 AM: |
11:48:56 AM: 435 | _beneficiary.send(amount); // Deliberate use of send to prevent reverting fallback. It's the user's responsibility to accept ETH.
11:48:56 AM: | ^^^^^^^^^^^^^^^^^^^^^^^^^
11:48:56 AM: Warning: Failure condition of 'send' ignored. Consider using 'transfer' instead.
11:48:56 AM: --> src/arbitration/evidence/ModeratedEvidenceModule.sol:333:32:
11:48:56 AM: |
11:48:56 AM: 333 | if (remainingETH != 0) _contributor.send(remainingETH);
11:48:56 AM: | ^^^^^^^^^^^^^^^^^^^^^^^^^^^^^^^
11:48:56 AM: Warning: Failure condition of 'send' ignored. Consider using 'transfer' instead.
11:48:56 AM: --> src/arbitration/evidence/ModeratedEvidenceModule.sol:387:9:
11:48:56 AM: |
11:48:56 AM: 387 | _beneficiary.send(reward); // It is the user responsibility to accept ETH.
11:48:56 AM: | ^^^^^^^^^^^^^^^^^^^^^^^^^
11:48:56 AM: Warning: Failure condition of 'send' ignored. Consider using 'transfer' instead.
11:48:56 AM: --> src/arbitration/university/KlerosCoreUniversity.sol:791:17:
11:48:56 AM: |
11:48:56 AM: 791 | payable(governor).send(round.totalFeesForJurors);
11:48:56 AM: | ^^^^^^^^^^^^^^^^^^^^^^^^^^^^^^^^^^^^^^^^^^^^^^^^
11:48:56 AM: Warning: Failure condition of 'send' ignored. Consider using 'transfer' instead.
11:48:56 AM: --> src/arbitration/university/KlerosCoreUniversity.sol:848:13:
11:48:56 AM: |
11:48:56 AM: 848 | payable(account).send(feeReward);
11:48:56 AM: | ^^^^^^^^^^^^^^^^^^^^^^^^^^^^^^^^
11:48:56 AM: Warning: Failure condition of 'send' ignored. Consider using 'transfer' instead.
11:48:56 AM: --> src/arbitration/university/KlerosCoreUniversity.sol:874:25:
11:48:56 AM: |
11:48:56 AM: 874 | payable(governor).send(leftoverFeeReward);
11:48:56 AM: | ^^^^^^^^^^^^^^^^^^^^^^^^^^^^^^^^^^^^^^^^^
11:48:56 AM: Warning: Return value of low-level calls not used.
11:48:56 AM: --> src/utils/TransactionBatcher.sol:20:13:
11:48:56 AM: |
11:48:56 AM: 20 | targets[i].call{value: values[i]}(datas[i]); // Intentionally ignoring return value.
11:48:56 AM: | ^^^^^^^^^^^^^^^^^^^^^^^^^^^^^^^^^^^^^^^^^^^
11:48:56 AM: Warning: Unnamed return variable can remain unassigned. Add an explicit return with value to all non-reverting code paths or name the variable.
11:48:56 AM: --> src/kleros-v1/kleros-liquid-xdai/xKlerosLiquidV2.sol:637:96:
11:48:56 AM: |
11:48:56 AM: 637 | function currentRuling(uint256 _disputeID) public view returns (uint256 ruling, bool tied, bool /*overridden*/) {
11:48:56 AM: | ^^^^
11:48:56 AM: Warning: Unnamed return variable can remain unassigned. Add an explicit return with value to all non-reverting code paths or name the variable.
11:48:56 AM: --> src/token/TestERC721.sol:74:68:
11:48:56 AM: |
11:48:56 AM: 74 | ) internal virtual override(ERC721, ERC721Enumerable) returns (address) {
11:48:56 AM: | ^^^^^^^
11:48:56 AM: Warning: Unused function parameter. Remove or comment out the variable name to silence this warning.
11:48:56 AM: --> src/gateway/mock/VeaMock.sol:21:97:
11:48:56 AM: |
11:48:56 AM: 21 | function sendMessage(address _to, bytes4 _fnSelector, bytes memory _data) external returns (uint64 msgId) {
11:48:56 AM: | ^^^^^^^^^^^^
11:48:56 AM: Warning: Unused local variable.
11:48:56 AM: --> src/gateway/mock/VeaMock.sol:28:24:
11:48:56 AM: |
11:48:56 AM: 28 | (bool success, bytes memory res) = _to.call(data);
11:48:56 AM: | ^^^^^^^^^^^^^^^^
11:48:56 AM: Warning: Unused function parameter. Remove or comment out the variable name to silence this warning.
11:48:56 AM: --> src/gateway/mock/VeaMock.sol:45:26:
11:48:56 AM: |
11:48:56 AM: 45 | function sendMessage(bytes32[] calldata _proof, uint64 _msgId, address _to, bytes calldata _message) external {
11:48:56 AM: | ^^^^^^^^^^^^^^^^^^^^^^^^^
11:48:56 AM: Warning: Unused function parameter. Remove or comment out the variable name to silence this warning.
11:48:56 AM: --> src/gateway/mock/VeaMock.sol:45:53:
11:48:56 AM: |
11:48:56 AM: 45 | function sendMessage(bytes32[] calldata _proof, uint64 _msgId, address _to, bytes calldata _message) external {
11:48:56 AM: | ^^^^^^^^^^^^^
11:48:56 AM: Warning: Unused function parameter. Remove or comment out the variable name to silence this warning.
11:48:56 AM: --> src/gateway/mock/VeaMock.sol:45:68:
11:48:56 AM: |
11:48:56 AM: 45 | function sendMessage(bytes32[] calldata _proof, uint64 _msgId, address _to, bytes calldata _message) external {
11:48:56 AM: | ^^^^^^^^^^^
11:48:56 AM: Warning: Unused function parameter. Remove or comment out the variable name to silence this warning.
11:48:56 AM: --> src/gateway/mock/VeaMock.sol:45:81:
11:48:56 AM: |
11:48:56 AM: 45 | function sendMessage(bytes32[] calldata _proof, uint64 _msgId, address _to, bytes calldata _message) external {
11:48:56 AM: | ^^^^^^^^^^^^^^^^^^^^^^^
11:48:56 AM: Warning: Unused function parameter. Remove or comment out the variable name to silence this warning.
11:48:56 AM: --> src/gateway/mock/VeaMock.sol:54:35:
11:48:56 AM: |
11:48:56 AM: 54 | function resolveDisputedClaim(uint256 _epoch, bytes32 _stateRoot, Claim memory _claim) external {
11:48:56 AM: | ^^^^^^^^^^^^^^
11:48:56 AM: Warning: Unused function parameter. Remove or comment out the variable name to silence this warning.
11:48:56 AM: --> src/gateway/mock/VeaMock.sol:54:51:
11:48:56 AM: |
11:48:56 AM: 54 | function resolveDisputedClaim(uint256 _epoch, bytes32 _stateRoot, Claim memory _claim) external {
11:48:56 AM: | ^^^^^^^^^^^^^^^^^^
11:48:56 AM: Warning: Unused function parameter. Remove or comment out the variable name to silence this warning.
11:48:56 AM: --> src/gateway/mock/VeaMock.sol:54:71:
11:48:56 AM: |
11:48:56 AM: 54 | function resolveDisputedClaim(uint256 _epoch, bytes32 _stateRoot, Claim memory _claim) external {
11:48:56 AM: | ^^^^^^^^^^^^^^^^^^^
11:48:56 AM: Warning: Unused function parameter. Remove or comment out the variable name to silence this warning.
11:48:56 AM: --> src/kleros-v1/kleros-liquid-xdai/WrappedPinakion.sol:116:62:
11:48:56 AM: |
11:48:56 AM: 116 | function onTokenBridged(address _token, uint256 _amount, bytes calldata _data) external {
11:48:56 AM: | ^^^^^^^^^^^^^^^^^^^^
11:48:56 AM: Warning: Unused function parameter. Remove or comment out the variable name to silence this warning.
11:48:56 AM: --> src/kleros-v1/kleros-liquid-xdai/xKlerosLiquidV2.sol:490:27:
11:48:56 AM: |
11:48:56 AM: 490 | function proxyPayment(address _owner) public payable override returns (bool allowed) {
11:48:56 AM: | ^^^^^^^^^^^^^^
11:48:56 AM: Warning: Unused function parameter. Remove or comment out the variable name to silence this warning.
11:48:56 AM: --> src/kleros-v1/kleros-liquid-xdai/xKlerosLiquidV2.sol:499:40:
11:48:56 AM: |
11:48:56 AM: 499 | function onTransfer(address _from, address _to, uint256 _amount) public override returns (bool allowed) {
11:48:56 AM: | ^^^^^^^^^^^
11:48:56 AM: Warning: Unused function parameter. Remove or comment out the variable name to silence this warning.
11:48:56 AM: --> src/kleros-v1/kleros-liquid-xdai/xKlerosLiquidV2.sol:513:24:
11:48:56 AM: |
11:48:56 AM: 513 | function onApprove(address _owner, address _spender, uint256 _amount) public override returns (bool allowed) {
11:48:56 AM: | ^^^^^^^^^^^^^^
11:48:56 AM: Warning: Unused function parameter. Remove or comment out the variable name to silence this warning.
11:48:56 AM: --> src/kleros-v1/kleros-liquid-xdai/xKlerosLiquidV2.sol:513:40:
11:48:56 AM: |
11:48:56 AM: 513 | function onApprove(address _owner, address _spender, uint256 _amount) public override returns (bool allowed) {
11:48:56 AM: | ^^^^^^^^^^^^^^^^
11:48:56 AM: Warning: Unused function parameter. Remove or comment out the variable name to silence this warning.
11:48:56 AM: --> src/kleros-v1/kleros-liquid-xdai/xKlerosLiquidV2.sol:513:58:
11:48:56 AM: |
11:48:56 AM: 513 | function onApprove(address _owner, address _spender, uint256 _amount) public override returns (bool allowed) {
11:48:56 AM: | ^^^^^^^^^^^^^^^
11:48:56 AM: Warning: Unused function parameter. Remove or comment out the variable name to silence this warning.
11:48:56 AM: --> src/rng/IncrementalNG.sol:26:32:
11:48:56 AM: |
11:48:56 AM: 26 | function receiveRandomness(uint256 _block) external override returns (uint256 randomNumber) {
11:48:56 AM: | ^^^^^^^^^^^^^^
11:48:56 AM: Warning: Unused function parameter. Remove or comment out the variable name to silence this warning.
11:48:56 AM: --> src/rng/mock/RandomizerMock.sol:10:22:
11:48:56 AM: |
11:48:56 AM: 10 | function request(uint256 callbackGasLimit) external override returns (uint256) {
11:48:56 AM: | ^^^^^^^^^^^^^^^^^^^^^^^^
11:48:56 AM: Warning: Unused function parameter. Remove or comment out the variable name to silence this warning.
11:48:56 AM: --> src/rng/mock/RandomizerMock.sol:14:31:
11:48:56 AM: |
11:48:56 AM: 14 | function clientWithdrawTo(address _to, uint256 _amount) external override {
11:48:56 AM: | ^^^^^^^^^^^
11:48:56 AM: Warning: Unused function parameter. Remove or comment out the variable name to silence this warning.
11:48:56 AM: --> src/rng/mock/RandomizerMock.sol:14:44:
11:48:56 AM: |
11:48:56 AM: 14 | function clientWithdrawTo(address _to, uint256 _amount) external override {
11:48:56 AM: | ^^^^^^^^^^^^^^^
11:48:56 AM: Warning: Function state mutability can be restricted to pure
11:48:56 AM: --> src/gateway/mock/VeaMock.sol:35:5:
11:48:56 AM: |
11:48:56 AM: 35 | function saveSnapshot() external {
11:48:56 AM: | ^ (Relevant source part starts here and spans across multiple lines).
11:48:56 AM: Warning: Function state mutability can be restricted to pure
11:48:56 AM: --> src/gateway/mock/VeaMock.sol:45:5:
11:48:56 AM: |
11:48:56 AM: 45 | function sendMessage(bytes32[] calldata _proof, uint64 _msgId, address _to, bytes calldata _message) external {
11:48:56 AM: | ^ (Relevant source part starts here and spans across multiple lines).
11:48:56 AM: Warning: Function state mutability can be restricted to pure
11:48:56 AM: --> src/gateway/mock/VeaMock.sol:54:5:
11:48:56 AM: |
11:48:56 AM: 54 | function resolveDisputedClaim(uint256 _epoch, bytes32 _stateRoot, Claim memory _claim) external {
11:48:56 AM: | ^ (Relevant source part starts here and spans across multiple lines).
11:48:56 AM: Warning: Function state mutability can be restricted to pure
11:48:56 AM: --> src/kleros-v1/kleros-liquid-xdai/xKlerosLiquidV2.sol:478:5:
11:48:56 AM: |
11:48:56 AM: 478 | function createDispute(
11:48:56 AM: | ^ (Relevant source part starts here and spans across multiple lines).
11:48:56 AM: Warning: Function state mutability can be restricted to view
11:48:56 AM: --> src/kleros-v1/kleros-liquid-xdai/xKlerosLiquidV2.sol:499:5:
11:48:56 AM: |
11:48:56 AM: 499 | function onTransfer(address _from, address _to, uint256 _amount) public override returns (bool allowed) {
11:48:56 AM: | ^ (Relevant source part starts here and spans across multiple lines).
11:48:56 AM: Warning: Function state mutability can be restricted to pure
11:48:56 AM: --> src/kleros-v1/kleros-liquid-xdai/xKlerosLiquidV2.sol:513:5:
11:48:56 AM: |
11:48:56 AM: 513 | function onApprove(address _owner, address _spender, uint256 _amount) public override returns (bool allowed) {
11:48:56 AM: | ^ (Relevant source part starts here and spans across multiple lines).
11:48:56 AM: Warning: Function state mutability can be restricted to pure
11:48:56 AM: --> src/rng/mock/RandomizerMock.sol:14:5:
11:48:56 AM: |
11:48:56 AM: 14 | function clientWithdrawTo(address _to, uint256 _amount) external override {
11:48:56 AM: | ^ (Relevant source part starts here and spans across multiple lines).
11:48:56 AM: Done in 18s 849ms
11:48:57 AM: (node:7672) ExperimentalWarning: Importing JSON modules is an experimental feature and might change at any time
11:48:57 AM: (Use `node --trace-warnings ...` to show where the warning was created)
11:49:00 AM: [STARTED] Parse Configuration
11:49:00 AM: [SUCCESS] Parse Configuration
11:49:00 AM: [STARTED] Generate outputs
11:49:00 AM: [STARTED] Generate to ./src/graphql/
11:49:00 AM: [STARTED] Load GraphQL schemas
11:49:01 AM: [SUCCESS] Load GraphQL schemas
11:49:01 AM: [STARTED] Load GraphQL documents
11:49:01 AM: [SUCCESS] Load GraphQL documents
11:49:01 AM: [STARTED] Generate
11:49:01 AM: [FAILED] GraphQL Document Validation failed with 2 errors;
11:49:01 AM: [FAILED] Error 0: Field "userAddress_contains" is not defined by type "User_filter". Did you mean "disputes_contains" or "rounds_contains"?
11:49:01 AM: [FAILED] at /opt/build/repo/web/src/hooks/queries/useJurorsByCoherenceScore.ts:14:42
11:49:01 AM: [FAILED]
11:49:01 AM: [FAILED] Error 1: Cannot query field "totalLeaderboardJurors" on type "Counter".
11:49:01 AM: [FAILED] at /opt/build/repo/web/src/hooks/queries/useTotalLeaderboardJurors.ts:4:7
11:49:01 AM: [SUCCESS] Generate outputs
11:49:01 AM:
11:49:01 AM: "build.command" failed
11:49:01 AM: ────────────────────────────────────────────────────────────────
11:49:01 AM: ​
11:49:01 AM: Error message
11:49:01 AM: Command failed with exit code 1: yarn build:web:ci (https://ntl.fyi/exit-code-1)
11:49:01 AM: ​
11:49:01 AM: Error location
11:49:01 AM: In Build command from Netlify app:
11:49:01 AM: yarn build:web:ci
11:49:01 AM: ​
11:49:01 AM: Resolved config
11:49:01 AM: build:
11:49:01 AM: command: yarn build:web:ci
11:49:01 AM: commandOrigin: ui
11:49:01 AM: environment:
11:49:01 AM: - ALCHEMY_API_KEY
11:49:01 AM: - NODE_OPTIONS
11:49:01 AM: - REACT_APP_ARBITRATOR_TYPE
11:49:01 AM: - REACT_APP_ATLAS_URI
11:49:01 AM: - REACT_APP_CONTEXT
11:49:01 AM: - REACT_APP_CORE_SUBGRAPH
11:49:01 AM: - REACT_APP_DEPLOYMENT
11:49:01 AM: - REACT_APP_DRT_ARBSEPOLIA_SUBGRAPH
11:49:01 AM: - REACT_APP_GRAPH_API_KEY
11:49:01 AM: - REACT_APP_IPFS_GATEWAY
11:49:01 AM: - REACT_APP_SENTRY_ENDPOINT
11:49:01 AM: - REACT_APP_STATUS_URL
11:49:01 AM: - REVIEW_ID
11:49:01 AM: - WALLETCONNECT_PROJECT_ID
11:49:01 AM: - NETLIFY_USE_YARN
11:49:01 AM: - NETLIFY_YARN_WORKSPACES
11:49:01 AM: - YARN_ENABLE_GLOBAL_CACHE
11:49:01 AM: publish: /opt/build/repo/web/dist
11:49:01 AM: publishOrigin: ui
11:49:01 AM: functionsDirectory: /opt/build/repo/web/netlify/functions
11:49:02 AM: Failed during stage 'building site': Build script returned non-zero exit code: 2 (https://ntl.fyi/exit-code-2)
11:49:02 AM: Build failed due to a user error: Build script returned non-zero exit code: 2
11:49:02 AM: Failing build: Failed to build site
11:49:02 AM: Finished processing build request in 2m41.089s

Deploying

Skipped
There is no log for this section

Cleanup

Skipped
There is no log for this section

Post-processing

Skipped
There is no log for this section