Skip to main content

Deploy details

Your deploy failed due to an error

Deploy failed for sage-swan-13ac7b

Add MOVEMENT

PR #348: main@2ac902f

Deploy log

Initializing

Complete
12:58:51 PM: Build ready to start
12:59:04 PM: build-image version: 9a361c83c6a43010ba0aa3ea38214accc0223b2c (focal)
12:59:04 PM: buildbot version: 9a4374dc9e2c1cbd2a152e441d69a3a6d7e12511
12:59:04 PM: Fetching cached dependencies
12:59:04 PM: Starting to download cache of 1020.5MB
12:59:06 PM: Finished downloading cache in 2.069s
12:59:06 PM: Starting to extract cache
12:59:16 PM: Finished extracting cache in 9.718s
12:59:16 PM: Finished fetching cache in 11.9s
12:59:16 PM: Starting to prepare the repo for build
12:59:16 PM: Preparing Git Reference pull/348/head
12:59:19 PM: Starting to install dependencies
12:59:19 PM: Started restoring cached mise cache
12:59:19 PM: Finished restoring cached mise cache
12:59:20 PM: mise python@3.13.2 install
12:59:20 PM: mise python@3.13.2 download cpython-3.13.2+20250212-x86_64-unknown-linux-gnu-install_only_stripped.tar.gz
12:59:20 PM: mise python@3.13.2 extract cpython-3.13.2+20250212-x86_64-unknown-linux-gnu-install_only_stripped.tar.gz
12:59:21 PM: mise python@3.13.2 python --version
12:59:21 PM: mise python@3.13.2 Python 3.13.2
12:59:21 PM: mise python@3.13.2 installed
12:59:21 PM: Python version set to 3.13
12:59:22 PM: Collecting pipenv
12:59:22 PM: Downloading pipenv-2024.4.1-py3-none-any.whl.metadata (17 kB)
12:59:22 PM: Collecting certifi (from pipenv)
12:59:22 PM: Downloading certifi-2025.1.31-py3-none-any.whl.metadata (2.5 kB)
12:59:22 PM: Collecting packaging>=22 (from pipenv)
12:59:22 PM: Downloading packaging-24.2-py3-none-any.whl.metadata (3.2 kB)
12:59:22 PM: Collecting setuptools>=67 (from pipenv)
12:59:22 PM: Downloading setuptools-76.0.0-py3-none-any.whl.metadata (6.7 kB)
12:59:22 PM: Collecting virtualenv>=20.24.2 (from pipenv)
12:59:22 PM: Downloading virtualenv-20.29.3-py3-none-any.whl.metadata (4.5 kB)
12:59:22 PM: Collecting distlib<1,>=0.3.7 (from virtualenv>=20.24.2->pipenv)
12:59:22 PM: Downloading distlib-0.3.9-py2.py3-none-any.whl.metadata (5.2 kB)
12:59:22 PM: Collecting filelock<4,>=3.12.2 (from virtualenv>=20.24.2->pipenv)
12:59:22 PM: Downloading filelock-3.17.0-py3-none-any.whl.metadata (2.9 kB)
12:59:22 PM: Collecting platformdirs<5,>=3.9.1 (from virtualenv>=20.24.2->pipenv)
12:59:22 PM: Downloading platformdirs-4.3.6-py3-none-any.whl.metadata (11 kB)
12:59:22 PM: Downloading pipenv-2024.4.1-py3-none-any.whl (3.0 MB)
12:59:23 PM: ━━━━━━━━━━━━━━━━━━━━━━━━━━━━━━━━━━━━━━━━ 3.0/3.0 MB 63.1 MB/s eta 0:00:00
12:59:23 PM: Downloading packaging-24.2-py3-none-any.whl (65 kB)
12:59:23 PM: Downloading setuptools-76.0.0-py3-none-any.whl (1.2 MB)
12:59:23 PM: ━━━━━━━━━━━━━━━━━━━━━━━━━━━━━━━━━━━━━━━━ 1.2/1.2 MB 63.0 MB/s eta 0:00:00
12:59:23 PM: Downloading virtualenv-20.29.3-py3-none-any.whl (4.3 MB)
12:59:23 PM: ━━━━━━━━━━━━━━━━━━━━━━━━━━━━━━━━━━━━━━━━ 4.3/4.3 MB 149.9 MB/s eta 0:00:00
12:59:23 PM: Downloading certifi-2025.1.31-py3-none-any.whl (166 kB)
12:59:23 PM: Downloading distlib-0.3.9-py2.py3-none-any.whl (468 kB)
12:59:23 PM: Downloading filelock-3.17.0-py3-none-any.whl (16 kB)
12:59:23 PM: Downloading platformdirs-4.3.6-py3-none-any.whl (18 kB)
12:59:23 PM: Installing collected packages: distlib, setuptools, platformdirs, packaging, filelock, certifi, virtualenv, pipenv
12:59:25 PM: Successfully installed certifi-2025.1.31 distlib-0.3.9 filelock-3.17.0 packaging-24.2 pipenv-2024.4.1 platformdirs-4.3.6 setuptools-76.0.0 virtualenv-20.29.3
12:59:25 PM: [notice] A new release of pip is available: 24.3.1 -> 25.0.1
12:59:25 PM: [notice] To update, run: pip install --upgrade pip
12:59:25 PM: Attempting Ruby version 2.7.2, read from environment
12:59:26 PM: Using Ruby version 2.7.2
12:59:26 PM: Started restoring cached go cache
12:59:26 PM: Finished restoring cached go cache
12:59:27 PM: go version go1.19.13 linux/amd64
12:59:28 PM: Using PHP version 8.0
12:59:29 PM: Started restoring cached Node.js version
12:59:30 PM: Finished restoring cached Node.js version
12:59:30 PM: v16.20.2 is already installed.
12:59:31 PM: Now using node v16.20.2 (npm v8.19.4)
12:59:31 PM: Enabling Node.js Corepack
12:59:31 PM: Started restoring cached build plugins
12:59:31 PM: Finished restoring cached build plugins
12:59:31 PM: Started restoring cached corepack dependencies
12:59:31 PM: Finished restoring cached corepack dependencies
12:59:31 PM: Started restoring cached yarn cache
12:59:31 PM: Finished restoring cached yarn cache
12:59:31 PM: Installing Yarn version 1.22.19
12:59:31 PM: Preparing yarn@1.22.19 for immediate activation...
12:59:31 PM: No yarn workspaces detected
12:59:31 PM: Started restoring cached node modules
12:59:31 PM: Finished restoring cached node modules
12:59:32 PM: Installing npm packages using Yarn version 1.22.19
12:59:32 PM: yarn install v1.22.19
12:59:32 PM: [1/4] Resolving packages...
12:59:32 PM: success Already up-to-date.
12:59:32 PM: Done in 0.37s.
12:59:32 PM: npm packages installed using Yarn
12:59:33 PM: Successfully installed dependencies
12:59:33 PM: Starting build script
12:59:34 PM: Detected 1 framework(s)
12:59:34 PM: "docusaurus" at version "2.4.3"
12:59:34 PM: Section completed: initializing

Building

Failed
12:59:35 PM: Netlify Build
12:59:35 PM: ────────────────────────────────────────────────────────────────
12:59:35 PM:
12:59:35 PM: ❯ Version
12:59:35 PM: @netlify/build 29.59.2
12:59:35 PM:
12:59:35 PM: ❯ Flags
12:59:35 PM: accountId: 62a0665150fac75d47993aed
12:59:35 PM: baseRelDir: true
12:59:35 PM: buildId: 67cece20866490000871724a
12:59:35 PM: deployId: 67cece20866490000871724c
12:59:35 PM:
12:59:35 PM: ❯ Current directory
12:59:35 PM: /opt/build/repo
12:59:35 PM:
12:59:35 PM: ❯ Config file
12:59:35 PM: No config file was defined: using default values.
12:59:35 PM:
12:59:35 PM: ❯ Context
12:59:35 PM: deploy-preview
12:59:35 PM:
12:59:35 PM: Build command from Netlify app
12:59:35 PM: ────────────────────────────────────────────────────────────────
12:59:35 PM: ​
12:59:35 PM: $ yarn build
12:59:36 PM: yarn run v1.22.19
12:59:36 PM: $ docusaurus build
12:59:37 PM: [INFO] [en] Creating an optimized production build...
12:59:37 PM: [REDOCUSAURUS] Options: {
12:59:37 PM: debug: true,
12:59:37 PM: specs: [
12:59:37 PM: { id: 'lava-api', spec: 'lava-api/openapi.yml', route: 'lava-api' }
12:59:37 PM: ],
12:59:37 PM: theme: {
12:59:37 PM: primaryColor: '#1890ff',
12:59:37 PM: options: { disableSearch: true },
12:59:37 PM: theme: { scrollYOffset: 100, sideNavStyle: 'id-only' }
12:59:37 PM: }
12:59:37 PM: }
12:59:37 PM: [REDOCUSAURUS] Specs: [ { id: 'lava-api', spec: 'lava-api/openapi.yml', route: 'lava-api' } ]
12:59:37 PM: [REDOCUSAURUS] Final: {
12:59:37 PM: "themes": [
12:59:37 PM: [
12:59:37 PM: "/opt/build/repo/node_modules/docusaurus-theme-redoc/dist/index.js",
12:59:37 PM: {
12:59:37 PM: "id": "theme-redoc",
12:59:37 PM: "primaryColor": "#1890ff",
12:59:37 PM: "options": {
12:59:37 PM: "disableSearch": true
12:59:37 PM: },
12:59:37 PM: "theme": {
12:59:37 PM: "scrollYOffset": 100,
12:59:37 PM: "sideNavStyle": "id-only"
12:59:37 PM: }
12:59:37 PM: }
12:59:37 PM: ]
12:59:37 PM: ],
12:59:37 PM: "plugins": [
12:59:37 PM: [
12:59:37 PM: "/opt/build/repo/node_modules/docusaurus-plugin-redoc/dist/index.js",
12:59:37 PM: {
12:59:37 PM: "id": "lava-api",
12:59:37 PM: "spec": "lava-api/openapi.yml",
12:59:37 PM: "route": "lava-api",
12:59:37 PM: "themeId": "theme-redoc",
12:59:37 PM: "debug": true
12:59:37 PM: }
12:59:37 PM: ]
12:59:37 PM: ]
12:59:37 PM: }
12:59:37 PM: [REDOCUSAURUS_PLUGIN] Opts Input: {
12:59:37 PM: id: 'lava-api',
12:59:37 PM: spec: 'lava-api/openapi.yml',
12:59:37 PM: route: 'lava-api',
12:59:37 PM: themeId: 'theme-redoc',
12:59:37 PM: debug: true,
12:59:37 PM: layout: {}
12:59:37 PM: }
12:59:37 PM: [REDOCUSAURUS_PLUGIN] Options: {
12:59:37 PM: layout: {},
12:59:37 PM: debug: true,
12:59:37 PM: id: 'lava-api',
12:59:37 PM: spec: 'lava-api/openapi.yml',
12:59:37 PM: route: 'lava-api',
12:59:37 PM: themeId: 'theme-redoc'
12:59:37 PM: }
12:59:37 PM: [REDOCUSAURUS_PLUGIN] reading file: lava-api/openapi.yml
12:59:37 PM: [REDOCUSAURUS_PLUGIN] File Bundled
12:59:37 PM: [ReDoc Compatibility mode]: Converting OpenAPI 2.0 to OpenAPI 3.0
12:59:37 PM: [REDOCUSAURUS_PLUGIN] Route: {
12:59:37 PM: modules: {
12:59:37 PM: specProps: '/opt/build/repo/.docusaurus/docusaurus-plugin-redoc/lava-api/redocApiSpecV1.2-lava-api.json',
12:59:37 PM: layoutProps: '/opt/build/repo/.docusaurus/docusaurus-plugin-redoc/lava-api/redocApiLayoutV1-lava-api.json'
12:59:37 PM: },
12:59:37 PM: component: '@theme/ApiDoc',
12:59:37 PM: exact: true,
12:59:37 PM: path: '/lava-api'
12:59:37 PM: }
12:59:37 PM: Nayan Patel - Plugin clarity adding...
12:59:37 PM: [WARNING] Duplicate routes found!
12:59:37 PM: - Attempting to create page at /spec-guide, but a page already exists at this route.
12:59:37 PM: - Attempting to create page at /starknet, but a page already exists at this route.
12:59:37 PM: This could lead to non-deterministic routing behavior.
12:59:38 PM: Browserslist: caniuse-lite is outdated. Please run:
12:59:38 PM: npx update-browserslist-db@latest
12:59:38 PM: Why you should do it regularly: https://github.com/browserslist/update-db#readme
12:59:38 PM: [info] [webpackbar] Compiling Client
12:59:38 PM: [info] [webpackbar] Compiling Server
12:59:46 PM: [WARNING] Docs markdown link couldn't be resolved: (followerNode_from_genesis.md) in "/opt/build/repo/docs/chains/movement-chain/movement-node-bardock-archive.md" for version current
[WARNING] Docs markdown link couldn't be resolved: (followerNode_from_genesis.md) in "/opt/build/repo/docs/chains/movement-chain/movement-node-bardock-archive.md" for version current
[success] [webpackbar] Client: Compiled successfully in 8.06s
12:59:50 PM: Component TabItems was not imported, exported, or provided by MDXProvider as global scope
12:59:50 PM: Component TabItems was not imported, exported, or provided by MDXProvider as global scope
12:59:50 PM: Component TabItems was not imported, exported, or provided by MDXProvider as global scope
12:59:50 PM: Component TabItems was not imported, exported, or provided by MDXProvider as global scope
12:59:50 PM: Component TabItems was not imported, exported, or provided by MDXProvider as global scope
12:59:50 PM: Component TabItems was not imported, exported, or provided by MDXProvider as global scope
12:59:50 PM: Component TabItems was not imported, exported, or provided by MDXProvider as global scope
12:59:50 PM: Component TabItems was not imported, exported, or provided by MDXProvider as global scope
12:59:50 PM: Component TabItems was not imported, exported, or provided by MDXProvider as global scope
12:59:50 PM: Component TabItems was not imported, exported, or provided by MDXProvider as global scope
12:59:50 PM: Component TabItems was not imported, exported, or provided by MDXProvider as global scope
12:59:50 PM: Component TabItems was not imported, exported, or provided by MDXProvider as global scope
12:59:50 PM: Component TabItems was not imported, exported, or provided by MDXProvider as global scope
12:59:50 PM: Component TabItems was not imported, exported, or provided by MDXProvider as global scope
12:59:50 PM: Component TabItems was not imported, exported, or provided by MDXProvider as global scope
12:59:50 PM: Component TabItems was not imported, exported, or provided by MDXProvider as global scope
12:59:50 PM: Component TabItems was not imported, exported, or provided by MDXProvider as global scope
12:59:50 PM: Component TabItems was not imported, exported, or provided by MDXProvider as global scope
12:59:50 PM: Component TabItems was not imported, exported, or provided by MDXProvider as global scope
12:59:50 PM: Component TabItems was not imported, exported, or provided by MDXProvider as global scope
12:59:50 PM: Component TabItems was not imported, exported, or provided by MDXProvider as global scope
12:59:50 PM: Component TabItems was not imported, exported, or provided by MDXProvider as global scope
12:59:50 PM: Component TabItems was not imported, exported, or provided by MDXProvider as global scope
12:59:50 PM: Component TabItems was not imported, exported, or provided by MDXProvider as global scope
12:59:50 PM: Component TabItems was not imported, exported, or provided by MDXProvider as global scope
12:59:50 PM: Component TabItems was not imported, exported, or provided by MDXProvider as global scope
12:59:50 PM: Component TabItems was not imported, exported, or provided by MDXProvider as global scope
12:59:50 PM: Component TabItems was not imported, exported, or provided by MDXProvider as global scope
12:59:50 PM: Component TabItems was not imported, exported, or provided by MDXProvider as global scope
12:59:50 PM: Component TabItems was not imported, exported, or provided by MDXProvider as global scope
12:59:50 PM: Component TabItems was not imported, exported, or provided by MDXProvider as global scope
12:59:50 PM: Component TabItems was not imported, exported, or provided by MDXProvider as global scope
12:59:50 PM: Component TabItems was not imported, exported, or provided by MDXProvider as global scope
12:59:50 PM: Component TabItems was not imported, exported, or provided by MDXProvider as global scope
12:59:50 PM: Component TabItems was not imported, exported, or provided by MDXProvider as global scope
12:59:50 PM: Component TabItems was not imported, exported, or provided by MDXProvider as global scope
12:59:50 PM: Component TabItems was not imported, exported, or provided by MDXProvider as global scope
12:59:50 PM: Component TabItems was not imported, exported, or provided by MDXProvider as global scope
12:59:50 PM: Component TabItems was not imported, exported, or provided by MDXProvider as global scope
12:59:50 PM: Component TabItems was not imported, exported, or provided by MDXProvider as global scope
12:59:50 PM: Component TabItems was not imported, exported, or provided by MDXProvider as global scope
12:59:50 PM: Component TabItems was not imported, exported, or provided by MDXProvider as global scope
12:59:50 PM: Component TabItems was not imported, exported, or provided by MDXProvider as global scope
12:59:50 PM: Component TabItems was not imported, exported, or provided by MDXProvider as global scope
12:59:50 PM: Component TabItems was not imported, exported, or provided by MDXProvider as global scope
12:59:50 PM: Component TabItems was not imported, exported, or provided by MDXProvider as global scope
12:59:50 PM: Component TabItems was not imported, exported, or provided by MDXProvider as global scope
12:59:50 PM: Component TabItems was not imported, exported, or provided by MDXProvider as global scope
12:59:50 PM: Component TabItems was not imported, exported, or provided by MDXProvider as global scope
12:59:50 PM: Component TabItems was not imported, exported, or provided by MDXProvider as global scope
12:59:50 PM: Component TabItems was not imported, exported, or provided by MDXProvider as global scope
12:59:50 PM: Component TabItems was not imported, exported, or provided by MDXProvider as global scope
12:59:50 PM: Component TabItems was not imported, exported, or provided by MDXProvider as global scope
12:59:50 PM: Component TabItems was not imported, exported, or provided by MDXProvider as global scope
12:59:50 PM: Component TabItems was not imported, exported, or provided by MDXProvider as global scope
12:59:50 PM: Component TabItems was not imported, exported, or provided by MDXProvider as global scope
12:59:50 PM: Component TabItems was not imported, exported, or provided by MDXProvider as global scope
12:59:50 PM: Component TabItems was not imported, exported, or provided by MDXProvider as global scope
12:59:50 PM: Component TabItems was not imported, exported, or provided by MDXProvider as global scope
12:59:50 PM: Component TabItems was not imported, exported, or provided by MDXProvider as global scope
12:59:51 PM: Component TabItems was not imported, exported, or provided by MDXProvider as global scope
12:59:51 PM: Component TabItems was not imported, exported, or provided by MDXProvider as global scope
12:59:51 PM: Component TabItems was not imported, exported, or provided by MDXProvider as global scope
12:59:51 PM: Component TabItems was not imported, exported, or provided by MDXProvider as global scope
12:59:51 PM: Component TabItems was not imported, exported, or provided by MDXProvider as global scope
12:59:51 PM: Component TabItems was not imported, exported, or provided by MDXProvider as global scope
12:59:51 PM: Component TabItems was not imported, exported, or provided by MDXProvider as global scope
12:59:51 PM: Component TabItems was not imported, exported, or provided by MDXProvider as global scope
12:59:51 PM: Component TabItems was not imported, exported, or provided by MDXProvider as global scope
12:59:51 PM: Component TabItems was not imported, exported, or provided by MDXProvider as global scope
12:59:51 PM: Component TabItems was not imported, exported, or provided by MDXProvider as global scope
12:59:51 PM: Component TabItems was not imported, exported, or provided by MDXProvider as global scope
12:59:51 PM: Component TabItems was not imported, exported, or provided by MDXProvider as global scope
12:59:51 PM: Component TabItems was not imported, exported, or provided by MDXProvider as global scope
12:59:51 PM: Component TabItems was not imported, exported, or provided by MDXProvider as global scope
12:59:51 PM: Component TabItems was not imported, exported, or provided by MDXProvider as global scope
12:59:51 PM: Component TabItems was not imported, exported, or provided by MDXProvider as global scope
12:59:51 PM: Component TabItems was not imported, exported, or provided by MDXProvider as global scope
12:59:51 PM: Component TabItems was not imported, exported, or provided by MDXProvider as global scope
12:59:51 PM: Component TabItems was not imported, exported, or provided by MDXProvider as global scope
12:59:51 PM: Component TabItems was not imported, exported, or provided by MDXProvider as global scope
12:59:51 PM: Component TabItems was not imported, exported, or provided by MDXProvider as global scope
12:59:51 PM: Component TabItems was not imported, exported, or provided by MDXProvider as global scope
12:59:51 PM: Component TabItems was not imported, exported, or provided by MDXProvider as global scope
12:59:51 PM: Component TabItems was not imported, exported, or provided by MDXProvider as global scope
12:59:51 PM: Component TabItems was not imported, exported, or provided by MDXProvider as global scope
12:59:51 PM: Component TabItems was not imported, exported, or provided by MDXProvider as global scope
12:59:51 PM: Component TabItems was not imported, exported, or provided by MDXProvider as global scope
12:59:51 PM: Component TabItems was not imported, exported, or provided by MDXProvider as global scope
12:59:51 PM: Component TabItems was not imported, exported, or provided by MDXProvider as global scope
12:59:51 PM: Component TabItems was not imported, exported, or provided by MDXProvider as global scope
12:59:51 PM: Component TabItems was not imported, exported, or provided by MDXProvider as global scope
12:59:51 PM: Component TabItems was not imported, exported, or provided by MDXProvider as global scope
12:59:51 PM: Component TabItems was not imported, exported, or provided by MDXProvider as global scope
12:59:51 PM: Component TabItems was not imported, exported, or provided by MDXProvider as global scope
12:59:51 PM: Component TabItems was not imported, exported, or provided by MDXProvider as global scope
12:59:51 PM: Component TabItems was not imported, exported, or provided by MDXProvider as global scope
12:59:51 PM: Component TabItems was not imported, exported, or provided by MDXProvider as global scope
12:59:51 PM: Component TabItems was not imported, exported, or provided by MDXProvider as global scope
12:59:51 PM: Component TabItems was not imported, exported, or provided by MDXProvider as global scope
12:59:51 PM: Component TabItems was not imported, exported, or provided by MDXProvider as global scope
12:59:51 PM: Component TabItems was not imported, exported, or provided by MDXProvider as global scope
12:59:51 PM: Component TabItems was not imported, exported, or provided by MDXProvider as global scope
12:59:51 PM: Component TabItems was not imported, exported, or provided by MDXProvider as global scope
12:59:51 PM: Component TabItems was not imported, exported, or provided by MDXProvider as global scope
12:59:51 PM: Component TabItems was not imported, exported, or provided by MDXProvider as global scope
12:59:51 PM: Component TabItems was not imported, exported, or provided by MDXProvider as global scope
12:59:51 PM: Component TabItems was not imported, exported, or provided by MDXProvider as global scope
12:59:51 PM: Component TabItems was not imported, exported, or provided by MDXProvider as global scope
12:59:51 PM: Component TabItems was not imported, exported, or provided by MDXProvider as global scope
12:59:51 PM: Component TabItems was not imported, exported, or provided by MDXProvider as global scope
12:59:51 PM: Component TabItems was not imported, exported, or provided by MDXProvider as global scope
12:59:51 PM: Component TabItems was not imported, exported, or provided by MDXProvider as global scope
12:59:51 PM: Component TabItems was not imported, exported, or provided by MDXProvider as global scope
12:59:51 PM: Component TabItems was not imported, exported, or provided by MDXProvider as global scope
12:59:51 PM: Component TabItems was not imported, exported, or provided by MDXProvider as global scope
12:59:51 PM: Component TabItems was not imported, exported, or provided by MDXProvider as global scope
12:59:51 PM: Component TabItems was not imported, exported, or provided by MDXProvider as global scope
12:59:51 PM: Component TabItems was not imported, exported, or provided by MDXProvider as global scope
12:59:51 PM: Component TabItems was not imported, exported, or provided by MDXProvider as global scope
12:59:51 PM: Component TabItems was not imported, exported, or provided by MDXProvider as global scope
12:59:51 PM: Component TabItems was not imported, exported, or provided by MDXProvider as global scope
12:59:51 PM: Component TabItems was not imported, exported, or provided by MDXProvider as global scope
12:59:51 PM: Component TabItems was not imported, exported, or provided by MDXProvider as global scope
12:59:52 PM: Component TabItems was not imported, exported, or provided by MDXProvider as global scope
12:59:52 PM: Component TabItems was not imported, exported, or provided by MDXProvider as global scope
12:59:52 PM: Component TabItems was not imported, exported, or provided by MDXProvider as global scope
12:59:52 PM: Component TabItems was not imported, exported, or provided by MDXProvider as global scope
12:59:52 PM: Component TabItems was not imported, exported, or provided by MDXProvider as global scope
12:59:52 PM: Component TabItems was not imported, exported, or provided by MDXProvider as global scope
12:59:52 PM: Component TabItems was not imported, exported, or provided by MDXProvider as global scope
12:59:52 PM: Component TabItems was not imported, exported, or provided by MDXProvider as global scope
12:59:52 PM: Component TabItems was not imported, exported, or provided by MDXProvider as global scope
12:59:52 PM: Component TabItems was not imported, exported, or provided by MDXProvider as global scope
12:59:52 PM: Component TabItems was not imported, exported, or provided by MDXProvider as global scope
12:59:52 PM: Component TabItems was not imported, exported, or provided by MDXProvider as global scope
12:59:52 PM: Component TabItems was not imported, exported, or provided by MDXProvider as global scope
12:59:52 PM: Component TabItems was not imported, exported, or provided by MDXProvider as global scope
12:59:52 PM: Component TabItems was not imported, exported, or provided by MDXProvider as global scope
12:59:52 PM: Component TabItems was not imported, exported, or provided by MDXProvider as global scope
12:59:52 PM: Component TabItems was not imported, exported, or provided by MDXProvider as global scope
12:59:52 PM: Component TabItems was not imported, exported, or provided by MDXProvider as global scope
12:59:52 PM: Component TabItems was not imported, exported, or provided by MDXProvider as global scope
12:59:52 PM: Component TabItems was not imported, exported, or provided by MDXProvider as global scope
12:59:52 PM: Component TabItems was not imported, exported, or provided by MDXProvider as global scope
12:59:52 PM: Component TabItems was not imported, exported, or provided by MDXProvider as global scope
12:59:52 PM: Component TabItems was not imported, exported, or provided by MDXProvider as global scope
12:59:52 PM: Component TabItems was not imported, exported, or provided by MDXProvider as global scope
12:59:52 PM: Component TabItems was not imported, exported, or provided by MDXProvider as global scope
12:59:52 PM: Component TabItems was not imported, exported, or provided by MDXProvider as global scope
12:59:52 PM: Component TabItems was not imported, exported, or provided by MDXProvider as global scope
12:59:52 PM: Component TabItems was not imported, exported, or provided by MDXProvider as global scope
12:59:52 PM: Component TabItems was not imported, exported, or provided by MDXProvider as global scope
12:59:52 PM: Component TabItems was not imported, exported, or provided by MDXProvider as global scope
12:59:52 PM: Component TabItems was not imported, exported, or provided by MDXProvider as global scope
12:59:52 PM: Component TabItems was not imported, exported, or provided by MDXProvider as global scope
12:59:53 PM: Component TabItems was not imported, exported, or provided by MDXProvider as global scope
12:59:53 PM: Component TabItems was not imported, exported, or provided by MDXProvider as global scope
12:59:53 PM: Component TabItems was not imported, exported, or provided by MDXProvider as global scope
12:59:53 PM: Component TabItems was not imported, exported, or provided by MDXProvider as global scope
12:59:53 PM: Component TabItems was not imported, exported, or provided by MDXProvider as global scope
12:59:53 PM: Component TabItems was not imported, exported, or provided by MDXProvider as global scope
12:59:53 PM: Component TabItems was not imported, exported, or provided by MDXProvider as global scope
12:59:53 PM: Component TabItems was not imported, exported, or provided by MDXProvider as global scope
12:59:53 PM: Component TabItems was not imported, exported, or provided by MDXProvider as global scope
12:59:53 PM: Component TabItems was not imported, exported, or provided by MDXProvider as global scope
12:59:53 PM: Component TabItems was not imported, exported, or provided by MDXProvider as global scope
12:59:53 PM: Component TabItems was not imported, exported, or provided by MDXProvider as global scope
12:59:53 PM: Component TabItems was not imported, exported, or provided by MDXProvider as global scope
12:59:53 PM: Component TabItems was not imported, exported, or provided by MDXProvider as global scope
12:59:53 PM: Component TabItems was not imported, exported, or provided by MDXProvider as global scope
12:59:53 PM: Component TabItems was not imported, exported, or provided by MDXProvider as global scope
12:59:53 PM: Component TabItems was not imported, exported, or provided by MDXProvider as global scope
12:59:53 PM: Component TabItems was not imported, exported, or provided by MDXProvider as global scope
12:59:53 PM: Component TabItems was not imported, exported, or provided by MDXProvider as global scope
12:59:53 PM: Component TabItems was not imported, exported, or provided by MDXProvider as global scope
12:59:53 PM: Component TabItems was not imported, exported, or provided by MDXProvider as global scope
12:59:53 PM: Component TabItems was not imported, exported, or provided by MDXProvider as global scope
12:59:53 PM: Component TabItems was not imported, exported, or provided by MDXProvider as global scope
12:59:53 PM: Component TabItems was not imported, exported, or provided by MDXProvider as global scope
12:59:54 PM: Component TabItems was not imported, exported, or provided by MDXProvider as global scope
12:59:54 PM: Component TabItems was not imported, exported, or provided by MDXProvider as global scope
12:59:54 PM: Component TabItems was not imported, exported, or provided by MDXProvider as global scope
12:59:54 PM: Component TabItems was not imported, exported, or provided by MDXProvider as global scope
12:59:54 PM: Component TabItems was not imported, exported, or provided by MDXProvider as global scope
12:59:54 PM: Component TabItems was not imported, exported, or provided by MDXProvider as global scope
12:59:54 PM: Component TabItems was not imported, exported, or provided by MDXProvider as global scope
12:59:54 PM: Component TabItems was not imported, exported, or provided by MDXProvider as global scope
12:59:54 PM: Component TabItems was not imported, exported, or provided by MDXProvider as global scope
12:59:54 PM: Component TabItems was not imported, exported, or provided by MDXProvider as global scope
12:59:54 PM: Component TabItems was not imported, exported, or provided by MDXProvider as global scope
12:59:54 PM: Component TabItems was not imported, exported, or provided by MDXProvider as global scope
12:59:54 PM: Component TabItems was not imported, exported, or provided by MDXProvider as global scope
12:59:54 PM: Component TabItems was not imported, exported, or provided by MDXProvider as global scope
12:59:54 PM: Component TabItems was not imported, exported, or provided by MDXProvider as global scope
12:59:54 PM: Component TabItems was not imported, exported, or provided by MDXProvider as global scope
12:59:55 PM: [success] [webpackbar] Server: Compiled successfully in 17.26s
12:59:56 PM: [REDOCUSAURUS_PLUGIN] creating static bundle copy for download /opt/build/repo/build/redocusaurus/lava-api.yaml
12:59:56 PM: [ERROR] Unable to build website for locale en.
12:59:56 PM: [ERROR] Error: Docusaurus found broken links!
12:59:56 PM:
12:59:56 PM: Please check the pages of your site in the list below, and make sure you don't reference any path that does not exist.
Note: it's possible to ignore broken links with the 'onBrokenLinks' Docusaurus configuration, and let the build pass.
12:59:56 PM: Exhaustive list of all broken links found:
12:59:56 PM:
12:59:56 PM: - On source page path = /movement-node:
12:59:56 PM: -> linking to /general/Mainnet/node_level_architecture
12:59:56 PM:
12:59:56 PM: - On source page path = /movement-node-bardock-archive:
12:59:56 PM: -> linking to followerNode_from_genesis.md (resolved as: /followerNode_from_genesis.md)
12:59:56 PM:
12:59:56 PM: - On source page path = /movement-node-genesis:
12:59:56 PM: -> linking to /general/Mainnet/node_level_architecture
12:59:56 PM: -> linking to config.json (resolved as: /config.json)
12:59:56 PM:
12:59:56 PM: at throwError (/opt/build/repo/node_modules/@docusaurus/logger/lib/index.js:76:11)
12:59:56 PM: at handleBrokenLinks (/opt/build/repo/node_modules/@docusaurus/core/lib/server/brokenLinks.js:153:47)
12:59:56 PM: at async buildLocale (/opt/build/repo/node_modules/@docusaurus/core/lib/commands/build.js:186:5)
12:59:56 PM: at async tryToBuildLocale (/opt/build/repo/node_modules/@docusaurus/core/lib/commands/build.js:41:20)
12:59:56 PM: at async mapAsyncSequential (/opt/build/repo/node_modules/@docusaurus/utils/lib/jsUtils.js:34:24)
12:59:56 PM: at async Command.build (/opt/build/repo/node_modules/@docusaurus/core/lib/commands/build.js:76:21)
12:59:56 PM: [INFO] Docusaurus version: 2.4.3
12:59:56 PM: Node version: v16.20.2
12:59:56 PM: error Command failed with exit code 1. (https://ntl.fyi/exit-code-1)
12:59:56 PM: info Visit https://yarnpkg.com/en/docs/cli/run for documentation about this command.
12:59:56 PM:
12:59:56 PM: "build.command" failed
12:59:56 PM: ────────────────────────────────────────────────────────────────
12:59:56 PM: ​
12:59:56 PM: Error message
12:59:56 PM: Command failed with exit code 1: yarn build (https://ntl.fyi/exit-code-1)
12:59:56 PM: ​
12:59:56 PM: Error location
12:59:56 PM: In Build command from Netlify app:
12:59:56 PM: yarn build
12:59:56 PM: ​
12:59:56 PM: Resolved config
12:59:56 PM: build:
12:59:56 PM: command: yarn build
12:59:56 PM: commandOrigin: ui
12:59:56 PM: environment:
12:59:56 PM: - ALGOLIA_API_KEY
12:59:56 PM: - ALGOLIA_APP_ID
12:59:56 PM: - ALGOLIA_INDEX_NAME
12:59:56 PM: - REVIEW_ID
12:59:56 PM: publish: /opt/build/repo/build
12:59:56 PM: publishOrigin: ui
12:59:57 PM: Failed during stage 'building site': Build script returned non-zero exit code: 2 (https://ntl.fyi/exit-code-2)
12:59:57 PM: Build failed due to a user error: Build script returned non-zero exit code: 2
12:59:57 PM: Failing build: Failed to build site
12:59:57 PM: Finished processing build request in 53.599s

Deploying

Skipped
There is no log for this section

Cleanup

Skipped
There is no log for this section

Post-processing

Skipped
There is no log for this section