Skip to main content

Deploy details

Your deploy failed due to an error

Deploy failed for vuestic-docs

chore(deps): bump store2 from 2.14.3 to 2.14.4

PR #4460: dependabot/npm_and_yarn/store2-2.14.4@5d0e016

Deploy log

Initializing

Complete
11:12:53 PM: Build ready to start
11:13:06 PM: build-image version: 8da544feea4fb5eeec1ff8d1b6a4cecf1a72b852 (focal)
11:13:06 PM: buildbot version: 8da544feea4fb5eeec1ff8d1b6a4cecf1a72b852
11:13:06 PM: Fetching cached dependencies
11:13:06 PM: Failed to fetch cache, continuing with build
11:13:06 PM: Starting to prepare the repo for build
11:13:06 PM: No cached dependencies found. Cloning fresh repo
11:13:06 PM: git clone --filter=blob:none https://github.com/epicmaxco/vuestic-ui
11:13:07 PM: Preparing Git Reference pull/4460/head
11:13:08 PM: Custom build command detected. Proceeding with the specified command: 'yarn build:docs:ci'
11:13:09 PM: Starting to install dependencies
11:13:10 PM: mise python@3.13.1 install
11:13:10 PM: mise python@3.13.1 download cpython-3.13.1+20250115-x86_64-unknown-linux-gnu-install_only_stripped.tar.gz
11:13:10 PM: mise python@3.13.1 extract cpython-3.13.1+20250115-x86_64-unknown-linux-gnu-install_only_stripped.tar.gz
11:13:11 PM: mise python@3.13.1 python --version
11:13:11 PM: mise python@3.13.1 Python 3.13.1
11:13:11 PM: mise python@3.13.1 installed
11:13:11 PM: Python version set to 3.13
11:13:12 PM: Collecting pipenv
11:13:12 PM: Downloading pipenv-2024.4.1-py3-none-any.whl.metadata (17 kB)
11:13:12 PM: Collecting certifi (from pipenv)
11:13:12 PM: Downloading certifi-2024.12.14-py3-none-any.whl.metadata (2.3 kB)
11:13:12 PM: Collecting packaging>=22 (from pipenv)
11:13:12 PM: Downloading packaging-24.2-py3-none-any.whl.metadata (3.2 kB)
11:13:12 PM: Collecting setuptools>=67 (from pipenv)
11:13:12 PM: Downloading setuptools-75.8.0-py3-none-any.whl.metadata (6.7 kB)
11:13:12 PM: Collecting virtualenv>=20.24.2 (from pipenv)
11:13:12 PM: Downloading virtualenv-20.29.1-py3-none-any.whl.metadata (4.5 kB)
11:13:12 PM: Collecting distlib<1,>=0.3.7 (from virtualenv>=20.24.2->pipenv)
11:13:12 PM: Downloading distlib-0.3.9-py2.py3-none-any.whl.metadata (5.2 kB)
11:13:12 PM: Collecting filelock<4,>=3.12.2 (from virtualenv>=20.24.2->pipenv)
11:13:12 PM: Downloading filelock-3.17.0-py3-none-any.whl.metadata (2.9 kB)
11:13:12 PM: Collecting platformdirs<5,>=3.9.1 (from virtualenv>=20.24.2->pipenv)
11:13:12 PM: Downloading platformdirs-4.3.6-py3-none-any.whl.metadata (11 kB)
11:13:12 PM: Downloading pipenv-2024.4.1-py3-none-any.whl (3.0 MB)
11:13:12 PM: ━━━━━━━━━━━━━━━━━━━━━━━━━━━━━━━━━━━━━━━━ 3.0/3.0 MB 67.1 MB/s eta 0:00:00
11:13:12 PM: Downloading packaging-24.2-py3-none-any.whl (65 kB)
11:13:13 PM: Downloading setuptools-75.8.0-py3-none-any.whl (1.2 MB)
11:13:13 PM: ━━━━━━━━━━━━━━━━━━━━━━━━━━━━━━━━━━━━━━━━ 1.2/1.2 MB 72.5 MB/s eta 0:00:00
11:13:13 PM: Downloading virtualenv-20.29.1-py3-none-any.whl (4.3 MB)
11:13:13 PM: ━━━━━━━━━━━━━━━━━━━━━━━━━━━━━━━━━━━━━━━━ 4.3/4.3 MB 175.0 MB/s eta 0:00:00
11:13:13 PM: Downloading certifi-2024.12.14-py3-none-any.whl (164 kB)
11:13:13 PM: Downloading distlib-0.3.9-py2.py3-none-any.whl (468 kB)
11:13:13 PM: Downloading filelock-3.17.0-py3-none-any.whl (16 kB)
11:13:13 PM: Downloading platformdirs-4.3.6-py3-none-any.whl (18 kB)
11:13:13 PM: Installing collected packages: distlib, setuptools, platformdirs, packaging, filelock, certifi, virtualenv, pipenv
11:13:15 PM: Successfully installed certifi-2024.12.14 distlib-0.3.9 filelock-3.17.0 packaging-24.2 pipenv-2024.4.1 platformdirs-4.3.6 setuptools-75.8.0 virtualenv-20.29.1
11:13:15 PM: Attempting Ruby version 2.7.2, read from environment
11:13:16 PM: Using Ruby version 2.7.2
11:13:17 PM: Started restoring cached go cache
11:13:17 PM: Finished restoring cached go cache
11:13:18 PM: go version go1.19.13 linux/amd64
11:13:19 PM: Using PHP version 8.0
11:13:21 PM: Attempting Node.js version 'v18.20.2' from .nvmrc
11:13:21 PM: Downloading and installing node v18.20.2...
11:13:21 PM: Computing checksum with sha256sum
11:13:21 PM: Checksums matched!
11:13:23 PM: Now using node v18.20.2 (npm v10.5.0)
11:13:23 PM: Enabling Node.js Corepack
11:13:23 PM: Started restoring cached build plugins
11:13:23 PM: Finished restoring cached build plugins
11:13:23 PM: Started restoring cached corepack dependencies
11:13:24 PM: Finished restoring cached corepack dependencies
11:13:24 PM: Started restoring cached yarn cache
11:13:24 PM: Finished restoring cached yarn cache
11:13:24 PM: Installing Yarn version 1.22.19
11:13:24 PM: Preparing yarn@1.22.19 for immediate activation...
11:13:24 PM: yarn workspaces detected
11:13:24 PM: Installing npm packages using Yarn version 1.22.19
11:13:25 PM: yarn install v1.22.19
11:13:25 PM: [1/4] Resolving packages...
11:13:25 PM: warning Resolution field "sass@1.52.0" is incompatible with requested version "sass@^1.57.1"
11:13:25 PM: warning Resolution field "vue@3.5.12" is incompatible with requested version "vue@3.4.8"
11:13:25 PM: warning Resolution field "sass@1.52.0" is incompatible with requested version "sass@^1.57.1"
11:13:25 PM: warning Resolution field "sass@1.52.0" is incompatible with requested version "sass@^1.57.1"
11:13:25 PM: warning Resolution field "typescript@5.3.2" is incompatible with requested version "typescript@^4.9.3"
11:13:25 PM: [2/4] Fetching packages...
11:14:12 PM: warning vscode-languageclient@7.0.0: The engine "vscode" appears to be invalid.
11:14:12 PM: [3/4] Linking dependencies...
11:14:12 PM: warning "lerna > @lerna/version > @lerna/github-client > @octokit/rest > @octokit/plugin-request-log@1.0.4" has unmet peer dependency "@octokit/core@>=3".
11:14:12 PM: warning " > @vuestic/compiler@0.1.0" has unmet peer dependency "tsup@^8.1.0".
11:14:12 PM: warning " > @vuestic/compiler@0.1.0" has unmet peer dependency "vite@^5.3.3".
11:14:12 PM: warning " > @vuestic/tailwind@0.1.5" has unmet peer dependency "tailwindcss@^3.2.4".
11:14:12 PM: warning "workspace-aggregator-48156240-0c56-465d-8be3-ef547c2e526d > @vuestic/formkit > @storybook/vue3-vite@7.6.17" has unmet peer dependency "vite@^3.0.0 || ^4.0.0 || ^5.0.0".
11:14:12 PM: warning "workspace-aggregator-48156240-0c56-465d-8be3-ef547c2e526d > @vuestic/nuxt > @nuxt/module-builder@0.5.5" has unmet peer dependency "nuxi@^3.10.0".
11:14:12 PM: warning "workspace-aggregator-48156240-0c56-465d-8be3-ef547c2e526d > sandbox > ts-node@10.9.2" has unmet peer dependency "@types/node@*".
11:14:12 PM: warning "workspace-aggregator-48156240-0c56-465d-8be3-ef547c2e526d > vuestic-ui > @rollup/plugin-commonjs@19.0.2" has incorrect peer dependency "rollup@^2.38.3".
11:14:12 PM: warning "workspace-aggregator-48156240-0c56-465d-8be3-ef547c2e526d > vuestic-ui > @rollup/plugin-node-resolve@13.3.0" has incorrect peer dependency "rollup@^2.42.0".
11:14:12 PM: warning "workspace-aggregator-48156240-0c56-465d-8be3-ef547c2e526d > vuestic-ui > @vue/eslint-config-standard@6.1.0" has incorrect peer dependency "eslint@^7.12.1".
11:14:12 PM: warning "workspace-aggregator-48156240-0c56-465d-8be3-ef547c2e526d > vuestic-ui > @vue/eslint-config-standard@6.1.0" has incorrect peer dependency "eslint-plugin-vue@^7.0.0".
11:14:12 PM: warning "workspace-aggregator-48156240-0c56-465d-8be3-ef547c2e526d > vuestic-ui > rollup-plugin-terser@7.0.2" has incorrect peer dependency "rollup@^2.0.0".
11:14:12 PM: warning "workspace-aggregator-48156240-0c56-465d-8be3-ef547c2e526d > vuestic-ui > vite-plugin-chunk-split@0.4.7" has incorrect peer dependency "vite@^3.1.0".
11:14:12 PM: warning "workspace-aggregator-48156240-0c56-465d-8be3-ef547c2e526d > docs > nuxt > @nuxt/devtools@1.6.0" has unmet peer dependency "vite@*".
11:14:12 PM: warning "workspace-aggregator-48156240-0c56-465d-8be3-ef547c2e526d > @vuestic/formkit > @storybook/vue3-vite > @storybook/builder-vite@7.6.17" has unmet peer dependency "vite@^3.0.0 || ^4.0.0 || ^5.0.0".
11:14:12 PM: warning "workspace-aggregator-48156240-0c56-465d-8be3-ef547c2e526d > vuestic-ui > @rollup/plugin-commonjs > @rollup/pluginutils@3.1.0" has incorrect peer dependency "rollup@^1.20.0||^2.0.0".
11:14:12 PM: warning "workspace-aggregator-48156240-0c56-465d-8be3-ef547c2e526d > vuestic-ui > @vue/eslint-config-standard > eslint-config-standard@16.0.3" has incorrect peer dependency "eslint@^7.12.1".
11:14:12 PM: warning "workspace-aggregator-48156240-0c56-465d-8be3-ef547c2e526d > vuestic-ui > @vue/eslint-config-standard > eslint-import-resolver-webpack@0.13.8" has unmet peer dependency "webpack@>=1.11.0".
11:14:12 PM: warning "workspace-aggregator-48156240-0c56-465d-8be3-ef547c2e526d > docs > @docsearch/js > @docsearch/react > @algolia/autocomplete-preset-algolia@1.9.3" has unmet peer dependency "@algolia/client-search@>= 4.9.1 < 6".
11:14:12 PM: warning "workspace-aggregator-48156240-0c56-465d-8be3-ef547c2e526d > docs > nuxt > @nuxt/devtools > @nuxt/devtools-kit@1.6.0" has unmet peer dependency "vite@*".
11:14:12 PM: warning "workspace-aggregator-48156240-0c56-465d-8be3-ef547c2e526d > docs > nuxt > @nuxt/devtools > vite-plugin-inspect@0.8.7" has unmet peer dependency "vite@^3.1.0 || ^4.0.0 || ^5.0.0-0".
11:14:12 PM: warning "workspace-aggregator-48156240-0c56-465d-8be3-ef547c2e526d > docs > nuxt > @nuxt/devtools > vite-plugin-vue-inspector@5.1.3" has unmet peer dependency "vite@^3.0.0-0 || ^4.0.0-0 || ^5.0.0-0".
11:14:12 PM: warning "workspace-aggregator-48156240-0c56-465d-8be3-ef547c2e526d > docs > @docsearch/js > @docsearch/react > @algolia/autocomplete-core > @algolia/autocomplete-plugin-algolia-insights@1.9.3" has unmet peer dependency "search-insights@>= 1 < 3".
11:14:12 PM: warning "workspace-aggregator-48156240-0c56-465d-8be3-ef547c2e526d > docs > @docsearch/js > @docsearch/react > @algolia/autocomplete-core > @algolia/autocomplete-shared@1.9.3" has unmet peer dependency "@algolia/client-search@>= 4.9.1 < 6".
11:14:12 PM: warning "workspace-aggregator-48156240-0c56-465d-8be3-ef547c2e526d > docs > nuxt > @nuxt/devtools > @vue/devtools-core > vite-hot-client@0.2.3" has unmet peer dependency "vite@^2.6.0 || ^3.0.0 || ^4.0.0 || ^5.0.0-0".
11:14:43 PM: [4/4] Building fresh packages...
11:14:46 PM: Done in 81.24s.
11:14:46 PM: npm packages installed using Yarn
11:14:47 PM: Successfully installed dependencies
11:14:47 PM: Starting build script
11:14:48 PM: Detected 0 framework(s)
11:14:48 PM: Section completed: initializing

Building

Failed
11:14:49 PM: Netlify Build
11:14:49 PM: ────────────────────────────────────────────────────────────────
11:14:49 PM:
11:14:49 PM: ❯ Version
11:14:49 PM: @netlify/build 29.58.4
11:14:49 PM:
11:14:49 PM: ❯ Flags
11:14:49 PM: accountId: 66d06a6eb5c0a805a9a985c0
11:14:49 PM: baseRelDir: true
11:14:49 PM: buildId: 67941e743a2cb40008030274
11:14:49 PM: deployId: 67941e743a2cb40008030276
11:14:49 PM: packagePath: packages/docs
11:14:50 PM:
11:14:50 PM: ❯ Current directory
11:14:50 PM: /opt/build/repo
11:14:50 PM:
11:14:50 PM: ❯ Config file
11:14:50 PM: /opt/build/repo/packages/docs/netlify.toml
11:14:50 PM:
11:14:50 PM: ❯ Context
11:14:50 PM: deploy-preview
11:14:50 PM:
11:14:50 PM: ❯ Installing plugins
11:14:50 PM: - @netlify/plugin-lighthouse@6.0.1
11:15:05 PM:
11:15:05 PM: ❯ Loading plugins
11:15:05 PM: - @netlify/plugin-lighthouse@6.0.1 from Netlify app
11:15:06 PM:
11:15:06 PM: build.command from netlify.toml
11:15:06 PM: ────────────────────────────────────────────────────────────────
11:15:06 PM: ​
11:15:06 PM: $ yarn build:docs:ci
11:15:06 PM: yarn run v1.22.19
11:15:06 PM: $ yarn workspace @vuestic/formkit build && yarn workspace docs build:ci
11:15:07 PM: $ tsup src/index.ts --format esm --dts
11:15:07 PM: CLI Building entry: src/index.ts
11:15:07 PM: CLI Using tsconfig: tsconfig.json
11:15:07 PM: CLI tsup v6.7.0
11:15:07 PM: CLI Target: es2022
11:15:07 PM: ESM Build start
11:15:07 PM: ESM dist/index.js 26.22 KB
11:15:07 PM: ESM ⚡️ Build success in 29ms
11:15:07 PM: DTS Build start
11:15:07 PM: error TS5023: Unknown compiler option 'noUncheckedSideEffectImports'.
11:15:09 PM: error TS5023: Unknown compiler option 'noUncheckedSideEffectImports'.
11:15:09 PM: error TS5023: Unknown compiler option 'noUncheckedSideEffectImports'.
11:15:09 PM: error TS5023: Unknown compiler option 'noUncheckedSideEffectImports'.
11:15:09 PM: error TS5023: Unknown compiler option 'noUncheckedSideEffectImports'.
11:15:09 PM: error TS5023: Unknown compiler option 'noUncheckedSideEffectImports'.
11:15:09 PM: error TS5023: Unknown compiler option 'noUncheckedSideEffectImports'.
11:15:09 PM: error TS5023: Unknown compiler option 'noUncheckedSideEffectImports'.
11:15:09 PM: error TS5023: Unknown compiler option 'noUncheckedSideEffectImports'.
11:15:09 PM: error TS5023: Unknown compiler option 'noUncheckedSideEffectImports'.
11:15:09 PM: error TS5023: Unknown compiler option 'noUncheckedSideEffectImports'.
11:15:09 PM: error TS5023: Unknown compiler option 'noUncheckedSideEffectImports'.
11:15:09 PM: error TS5023: Unknown compiler option 'noUncheckedSideEffectImports'.
11:15:09 PM: error TS5023: Unknown compiler option 'noUncheckedSideEffectImports'.
11:15:09 PM: error TS5023: Unknown compiler option 'noUncheckedSideEffectImports'.
11:15:09 PM: error TS5023: Unknown compiler option 'noUncheckedSideEffectImports'.
11:15:09 PM: error TS5023: Unknown compiler option 'noUncheckedSideEffectImports'.
11:15:09 PM: error TS5023: Unknown compiler option 'noUncheckedSideEffectImports'.
11:15:09 PM: error TS5023: Unknown compiler option 'noUncheckedSideEffectImports'.
11:15:09 PM: error TS5023: Unknown compiler option 'noUncheckedSideEffectImports'.
11:15:09 PM: error TS5023: Unknown compiler option 'noUncheckedSideEffectImports'.
11:15:09 PM: error TS5023: Unknown compiler option 'noUncheckedSideEffectImports'.
11:15:09 PM: error TS5023: Unknown compiler option 'noUncheckedSideEffectImports'.
11:15:09 PM: src/inputs/button.ts(13,49): error TS2307: Cannot find module 'vuestic-ui' or its corresponding type declarations.
11:15:09 PM: Error: error occured in dts build
11:15:09 PM: at Worker.<anonymous> (/opt/build/repo/node_modules/tsup/dist/index.js:2281:26)
11:15:09 PM: at Worker.emit (node:events:517:28)
11:15:09 PM: at MessagePort.<anonymous> (node:internal/worker:256:53)
11:15:09 PM: at [nodejs.internal.kHybridDispatch] (node:internal/event_target:786:20)
11:15:09 PM: at exports.emitMessage (node:internal/per_context/messageport:23:28)
11:15:09 PM: DTS Build error
11:15:09 PM: RollupError: Failed to compile. Check the logs above.
11:15:09 PM: at error (/opt/build/repo/node_modules/rollup/dist/shared/rollup.js:353:30)
11:15:09 PM: at Object.error (/opt/build/repo/node_modules/rollup/dist/shared/rollup.js:1721:20)
11:15:09 PM: at Object.error (/opt/build/repo/node_modules/rollup/dist/shared/rollup.js:25627:42)
11:15:09 PM: at generateDtsFromTs (/opt/build/repo/node_modules/tsup/dist/rollup.js:7498:22)
11:15:09 PM: at /opt/build/repo/node_modules/tsup/dist/rollup.js:7505:59
11:15:09 PM: at _nullishCoalesce (/opt/build/repo/node_modules/tsup/dist/rollup.js:1:198)
11:15:09 PM: at Object.transform (/opt/build/repo/node_modules/tsup/dist/rollup.js:7505:18)
11:15:09 PM: at /opt/build/repo/node_modules/rollup/dist/shared/rollup.js:1914:40
11:15:09 PM: src/inputs/checkbox.ts(4,28): error TS2307: Cannot find module 'vuestic-ui' or its corresponding type declarations.
11:15:09 PM: src/inputs/colorpicker.ts(4,30): error TS2307: Cannot find module 'vuestic-ui' or its corresponding type declarations.
11:15:09 PM: src/inputs/datepicker.ts(4,29): error TS2307: Cannot find module 'vuestic-ui' or its corresponding type declarations.
11:15:09 PM: src/inputs/counter.ts(4,27): error TS2307: Cannot find module 'vuestic-ui' or its corresponding type declarations.
11:15:09 PM: src/inputs/file.ts(4,30): error TS2307: Cannot find module 'vuestic-ui' or its corresponding type declarations.
11:15:09 PM: src/inputs/form.ts(3,39): error TS2307: Cannot find module 'vuestic-ui' or its corresponding type declarations.
11:15:09 PM: src/inputs/radio.ts(4,38): error TS2307: Cannot find module 'vuestic-ui' or its corresponding type declarations.
11:15:09 PM: src/inputs/rating.ts(4,26): error TS2307: Cannot find module 'vuestic-ui' or its corresponding type declarations.
11:15:09 PM: src/inputs/select.ts(4,26): error TS2307: Cannot find module 'vuestic-ui' or its corresponding type declarations.
11:15:09 PM: src/inputs/slider.ts(4,39): error TS2307: Cannot find module 'vuestic-ui' or its corresponding type declarations.
11:15:09 PM: src/inputs/text.ts(4,25): error TS2307: Cannot find module 'vuestic-ui' or its corresponding type declarations.
11:15:09 PM: src/inputs/textarea.ts(4,28): error TS2307: Cannot find module 'vuestic-ui' or its corresponding type declarations.
11:15:09 PM: src/inputs/timepicker.ts(4,29): error TS2307: Cannot find module 'vuestic-ui' or its corresponding type declarations.
11:15:09 PM: src/inputs/toggle.ts(4,26): error TS2307: Cannot find module 'vuestic-ui' or its corresponding type declarations.
11:15:09 PM: src/inputs/togglebuttons.ts(4,32): error TS2307: Cannot find module 'vuestic-ui' or its corresponding type declarations.
11:15:09 PM: error Command failed with exit code 1. (https://ntl.fyi/exit-code-1)
11:15:09 PM: info Visit https://yarnpkg.com/en/docs/cli/run for documentation about this command.
11:15:09 PM: error Command failed.
11:15:09 PM: Exit code: 1
11:15:09 PM: Command: /opt/buildhome/.nvm/versions/node/v18.20.2/bin/node
11:15:09 PM: Arguments: /opt/buildhome/.cache/node/corepack/v1/yarn/1.22.19/lib/cli.js build
11:15:09 PM: Directory: /opt/build/repo/packages/formkit
11:15:09 PM: Output:
11:15:09 PM: info Visit https://yarnpkg.com/en/docs/cli/workspace for documentation about this command.
11:15:09 PM: error Command failed with exit code 1. (https://ntl.fyi/exit-code-1)
11:15:09 PM: info Visit https://yarnpkg.com/en/docs/cli/run for documentation about this command.
11:15:10 PM: Failed during stage 'building site': Build script returned non-zero exit code: 2 (https://ntl.fyi/exit-code-2)
11:15:10 PM:
11:15:10 PM: "build.command" failed
11:15:10 PM: ────────────────────────────────────────────────────────────────
11:15:10 PM: ​
11:15:10 PM: Error message
11:15:10 PM: Command failed with exit code 1: yarn build:docs:ci (https://ntl.fyi/exit-code-1)
11:15:10 PM: ​
11:15:10 PM: Error location
11:15:10 PM: In build.command from netlify.toml:
11:15:10 PM: yarn build:docs:ci
11:15:10 PM: ​
11:15:10 PM: Resolved config
11:15:10 PM: build:
11:15:10 PM: command: yarn build:docs:ci
11:15:10 PM: commandOrigin: config
11:15:10 PM: environment:
11:15:10 PM: - GTM_ENABLED
11:15:10 PM: - GTM_ID
11:15:10 PM: - HOSTNAME
11:15:10 PM: - RECAPTCHA_SITE_KEY
11:15:10 PM: - REVIEW_ID
11:15:10 PM: - STORYBOOK_HOSTNAME
11:15:10 PM: - VITE_STORYBOOK_HOSTNAME
11:15:10 PM: publish: /opt/build/repo/packages/docs/dist
11:15:10 PM: publishOrigin: config
11:15:10 PM: plugins:
11:15:10 PM: - inputs: {}
11:15:10 PM: origin: ui
11:15:10 PM: package: '@netlify/plugin-lighthouse'
11:15:10 PM: Build failed due to a user error: Build script returned non-zero exit code: 2
11:15:10 PM: Failing build: Failed to build site
11:15:11 PM: Finished processing build request in 2m4.858s

Deploying

Skipped
There is no log for this section

Cleanup

Skipped
There is no log for this section

Post-processing

Skipped
There is no log for this section