Skip to main content

Deploy details

Your deploy failed due to an error

Deploy failed for vuestic-docs

fix: correct even in useFocusableControl

PR #4484: fix/use-focusable-control-emit-event@81b36ff

Deploy log

Initializing

Complete
1:37:22 PM: Build ready to start
1:37:42 PM: build-image version: e2302d7bf4e0ce66ded1ed62fd22903c51eee112 (focal)
1:37:42 PM: buildbot version: e2302d7bf4e0ce66ded1ed62fd22903c51eee112
1:37:42 PM: Fetching cached dependencies
1:37:42 PM: Failed to fetch cache, continuing with build
1:37:42 PM: Starting to prepare the repo for build
1:37:43 PM: No cached dependencies found. Cloning fresh repo
1:37:43 PM: git clone --filter=blob:none https://github.com/epicmaxco/vuestic-ui
1:37:43 PM: Preparing Git Reference pull/4484/head
1:37:45 PM: Custom build command detected. Proceeding with the specified command: 'yarn build:docs:ci'
1:37:46 PM: Starting to install dependencies
1:37:47 PM: mise python@3.13.2 install
1:37:47 PM: mise python@3.13.2 download cpython-3.13.2+20250212-x86_64-unknown-linux-gnu-install_only_stripped.tar.gz
1:37:48 PM: mise python@3.13.2 extract cpython-3.13.2+20250212-x86_64-unknown-linux-gnu-install_only_stripped.tar.gz
1:37:48 PM: mise python@3.13.2 python --version
1:37:48 PM: mise python@3.13.2 Python 3.13.2
1:37:48 PM: mise python@3.13.2 installed
1:37:48 PM: Python version set to 3.13
1:37:51 PM: Collecting pipenv
1:37:51 PM: Downloading pipenv-2024.4.1-py3-none-any.whl.metadata (17 kB)
1:37:51 PM: Collecting certifi (from pipenv)
1:37:51 PM: Downloading certifi-2025.1.31-py3-none-any.whl.metadata (2.5 kB)
1:37:51 PM: Collecting packaging>=22 (from pipenv)
1:37:51 PM: Downloading packaging-24.2-py3-none-any.whl.metadata (3.2 kB)
1:37:51 PM: Collecting setuptools>=67 (from pipenv)
1:37:51 PM: Downloading setuptools-75.8.0-py3-none-any.whl.metadata (6.7 kB)
1:37:51 PM: Collecting virtualenv>=20.24.2 (from pipenv)
1:37:51 PM: Downloading virtualenv-20.29.2-py3-none-any.whl.metadata (4.5 kB)
1:37:51 PM: Collecting distlib<1,>=0.3.7 (from virtualenv>=20.24.2->pipenv)
1:37:51 PM: Downloading distlib-0.3.9-py2.py3-none-any.whl.metadata (5.2 kB)
1:37:51 PM: Collecting filelock<4,>=3.12.2 (from virtualenv>=20.24.2->pipenv)
1:37:51 PM: Downloading filelock-3.17.0-py3-none-any.whl.metadata (2.9 kB)
1:37:51 PM: Collecting platformdirs<5,>=3.9.1 (from virtualenv>=20.24.2->pipenv)
1:37:52 PM: Downloading platformdirs-4.3.6-py3-none-any.whl.metadata (11 kB)
1:37:52 PM: Downloading pipenv-2024.4.1-py3-none-any.whl (3.0 MB)
1:37:52 PM: ━━━━━━━━━━━━━━━━━━━━━━━━━━━━━━━━━━━━━━━━ 3.0/3.0 MB 20.4 MB/s eta 0:00:00
1:37:52 PM: Downloading packaging-24.2-py3-none-any.whl (65 kB)
1:37:52 PM: Downloading setuptools-75.8.0-py3-none-any.whl (1.2 MB)
1:37:52 PM: ━━━━━━━━━━━━━━━━━━━━━━━━━━━━━━━━━━━━━━━━ 1.2/1.2 MB 20.5 MB/s eta 0:00:00
1:37:52 PM: Downloading virtualenv-20.29.2-py3-none-any.whl (4.3 MB)
1:37:52 PM: ━━━━━━━━━━━━━━━━━━━━━━━━━━━━━━━━━━━━━━━━ 4.3/4.3 MB 77.6 MB/s eta 0:00:00
1:37:52 PM: Downloading certifi-2025.1.31-py3-none-any.whl (166 kB)
1:37:52 PM: Downloading distlib-0.3.9-py2.py3-none-any.whl (468 kB)
1:37:52 PM: Downloading filelock-3.17.0-py3-none-any.whl (16 kB)
1:37:52 PM: Downloading platformdirs-4.3.6-py3-none-any.whl (18 kB)
1:37:52 PM: Installing collected packages: distlib, setuptools, platformdirs, packaging, filelock, certifi, virtualenv, pipenv
1:37:55 PM: Successfully installed certifi-2025.1.31 distlib-0.3.9 filelock-3.17.0 packaging-24.2 pipenv-2024.4.1 platformdirs-4.3.6 setuptools-75.8.0 virtualenv-20.29.2
1:37:55 PM: [notice] A new release of pip is available: 24.3.1 -> 25.0.1
1:37:55 PM: [notice] To update, run: pip install --upgrade pip
1:37:55 PM: Attempting Ruby version 2.7.2, read from environment
1:37:56 PM: Using Ruby version 2.7.2
1:37:56 PM: Started restoring cached go cache
1:37:56 PM: Finished restoring cached go cache
1:37:57 PM: go version go1.19.13 linux/amd64
1:37:59 PM: Using PHP version 8.0
1:38:00 PM: Attempting Node.js version 'v18.20.2' from .nvmrc
1:38:00 PM: Downloading and installing node v18.20.2...
1:38:01 PM: Computing checksum with sha256sum
1:38:01 PM: Checksums matched!
1:38:03 PM: Now using node v18.20.2 (npm v10.5.0)
1:38:03 PM: Enabling Node.js Corepack
1:38:03 PM: Started restoring cached build plugins
1:38:03 PM: Finished restoring cached build plugins
1:38:03 PM: Started restoring cached corepack dependencies
1:38:03 PM: Finished restoring cached corepack dependencies
1:38:03 PM: Started restoring cached yarn cache
1:38:03 PM: Finished restoring cached yarn cache
1:38:04 PM: Installing Yarn version 1.22.19
1:38:04 PM: Preparing yarn@1.22.19 for immediate activation...
1:38:04 PM: yarn workspaces detected
1:38:04 PM: Installing npm packages using Yarn version 1.22.19
1:38:05 PM: yarn install v1.22.19
1:38:05 PM: [1/4] Resolving packages...
1:38:05 PM: warning Resolution field "sass@1.52.0" is incompatible with requested version "sass@^1.57.1"
1:38:05 PM: warning Resolution field "vue@3.5.12" is incompatible with requested version "vue@3.4.8"
1:38:05 PM: warning Resolution field "sass@1.52.0" is incompatible with requested version "sass@^1.57.1"
1:38:05 PM: warning Resolution field "sass@1.52.0" is incompatible with requested version "sass@^1.57.1"
1:38:05 PM: warning Resolution field "typescript@5.3.2" is incompatible with requested version "typescript@^4.9.3"
1:38:05 PM: [2/4] Fetching packages...
1:38:37 PM: warning vscode-languageclient@7.0.0: The engine "vscode" appears to be invalid.
1:38:37 PM: [3/4] Linking dependencies...
1:38:37 PM: warning "lerna > @lerna/version > @lerna/github-client > @octokit/rest > @octokit/plugin-request-log@1.0.4" has unmet peer dependency "@octokit/core@>=3".
1:38:37 PM: warning " > @vuestic/compiler@0.1.0" has unmet peer dependency "tsup@^8.1.0".
1:38:37 PM: warning " > @vuestic/compiler@0.1.0" has unmet peer dependency "vite@^5.3.3".
1:38:37 PM: warning " > @vuestic/tailwind@0.1.5" has unmet peer dependency "tailwindcss@^3.2.4".
1:38:37 PM: warning "workspace-aggregator-6ff5d910-40db-4f9b-9bc1-9c69ccd166d8 > @vuestic/formkit > @storybook/vue3-vite@7.6.17" has unmet peer dependency "vite@^3.0.0 || ^4.0.0 || ^5.0.0".
1:38:37 PM: warning "workspace-aggregator-6ff5d910-40db-4f9b-9bc1-9c69ccd166d8 > @vuestic/nuxt > @nuxt/module-builder@0.5.5" has unmet peer dependency "nuxi@^3.10.0".
1:38:37 PM: warning "workspace-aggregator-6ff5d910-40db-4f9b-9bc1-9c69ccd166d8 > sandbox > ts-node@10.9.2" has unmet peer dependency "@types/node@*".
1:38:37 PM: warning "workspace-aggregator-6ff5d910-40db-4f9b-9bc1-9c69ccd166d8 > vuestic-ui > @rollup/plugin-commonjs@19.0.2" has incorrect peer dependency "rollup@^2.38.3".
1:38:37 PM: warning "workspace-aggregator-6ff5d910-40db-4f9b-9bc1-9c69ccd166d8 > vuestic-ui > @rollup/plugin-node-resolve@13.3.0" has incorrect peer dependency "rollup@^2.42.0".
1:38:37 PM: warning "workspace-aggregator-6ff5d910-40db-4f9b-9bc1-9c69ccd166d8 > vuestic-ui > @vue/eslint-config-standard@6.1.0" has incorrect peer dependency "eslint@^7.12.1".
1:38:37 PM: warning "workspace-aggregator-6ff5d910-40db-4f9b-9bc1-9c69ccd166d8 > vuestic-ui > @vue/eslint-config-standard@6.1.0" has incorrect peer dependency "eslint-plugin-vue@^7.0.0".
1:38:37 PM: warning "workspace-aggregator-6ff5d910-40db-4f9b-9bc1-9c69ccd166d8 > vuestic-ui > rollup-plugin-terser@7.0.2" has incorrect peer dependency "rollup@^2.0.0".
1:38:37 PM: warning "workspace-aggregator-6ff5d910-40db-4f9b-9bc1-9c69ccd166d8 > vuestic-ui > vite-plugin-chunk-split@0.4.7" has incorrect peer dependency "vite@^3.1.0".
1:38:37 PM: warning "workspace-aggregator-6ff5d910-40db-4f9b-9bc1-9c69ccd166d8 > docs > nuxt > @nuxt/devtools@1.6.0" has unmet peer dependency "vite@*".
1:38:37 PM: warning "workspace-aggregator-6ff5d910-40db-4f9b-9bc1-9c69ccd166d8 > @vuestic/formkit > @storybook/vue3-vite > @storybook/builder-vite@7.6.17" has unmet peer dependency "vite@^3.0.0 || ^4.0.0 || ^5.0.0".
1:38:37 PM: warning "workspace-aggregator-6ff5d910-40db-4f9b-9bc1-9c69ccd166d8 > vuestic-ui > @rollup/plugin-commonjs > @rollup/pluginutils@3.1.0" has incorrect peer dependency "rollup@^1.20.0||^2.0.0".
1:38:37 PM: warning "workspace-aggregator-6ff5d910-40db-4f9b-9bc1-9c69ccd166d8 > vuestic-ui > @vue/eslint-config-standard > eslint-config-standard@16.0.3" has incorrect peer dependency "eslint@^7.12.1".
1:38:37 PM: warning "workspace-aggregator-6ff5d910-40db-4f9b-9bc1-9c69ccd166d8 > vuestic-ui > @vue/eslint-config-standard > eslint-import-resolver-webpack@0.13.8" has unmet peer dependency "webpack@>=1.11.0".
1:38:37 PM: warning "workspace-aggregator-6ff5d910-40db-4f9b-9bc1-9c69ccd166d8 > docs > @docsearch/js > @docsearch/react > @algolia/autocomplete-preset-algolia@1.9.3" has unmet peer dependency "@algolia/client-search@>= 4.9.1 < 6".
1:38:37 PM: warning "workspace-aggregator-6ff5d910-40db-4f9b-9bc1-9c69ccd166d8 > docs > nuxt > @nuxt/devtools > @nuxt/devtools-kit@1.6.0" has unmet peer dependency "vite@*".
1:38:37 PM: warning "workspace-aggregator-6ff5d910-40db-4f9b-9bc1-9c69ccd166d8 > docs > nuxt > @nuxt/devtools > vite-plugin-inspect@0.8.7" has unmet peer dependency "vite@^3.1.0 || ^4.0.0 || ^5.0.0-0".
1:38:37 PM: warning "workspace-aggregator-6ff5d910-40db-4f9b-9bc1-9c69ccd166d8 > docs > nuxt > @nuxt/devtools > vite-plugin-vue-inspector@5.1.3" has unmet peer dependency "vite@^3.0.0-0 || ^4.0.0-0 || ^5.0.0-0".
1:38:37 PM: warning "workspace-aggregator-6ff5d910-40db-4f9b-9bc1-9c69ccd166d8 > docs > @docsearch/js > @docsearch/react > @algolia/autocomplete-core > @algolia/autocomplete-plugin-algolia-insights@1.9.3" has unmet peer dependency "search-insights@>= 1 < 3".
1:38:37 PM: warning "workspace-aggregator-6ff5d910-40db-4f9b-9bc1-9c69ccd166d8 > docs > @docsearch/js > @docsearch/react > @algolia/autocomplete-core > @algolia/autocomplete-shared@1.9.3" has unmet peer dependency "@algolia/client-search@>= 4.9.1 < 6".
1:38:37 PM: warning "workspace-aggregator-6ff5d910-40db-4f9b-9bc1-9c69ccd166d8 > docs > nuxt > @nuxt/devtools > @vue/devtools-core > vite-hot-client@0.2.3" has unmet peer dependency "vite@^2.6.0 || ^3.0.0 || ^4.0.0 || ^5.0.0-0".
1:39:06 PM: [4/4] Building fresh packages...
1:39:08 PM: Done in 63.78s.
1:39:08 PM: npm packages installed using Yarn
1:39:09 PM: Successfully installed dependencies
1:39:09 PM: Starting build script
1:39:11 PM: Detected 0 framework(s)
1:39:11 PM: Section completed: initializing

Building

Failed
1:39:12 PM: Netlify Build
1:39:12 PM: ────────────────────────────────────────────────────────────────
1:39:12 PM:
1:39:12 PM: ❯ Version
1:39:12 PM: @netlify/build 29.59.1
1:39:12 PM:
1:39:12 PM: ❯ Flags
1:39:12 PM: accountId: 66d06a6eb5c0a805a9a985c0
1:39:12 PM: baseRelDir: true
1:39:12 PM: buildId: 67bd94a7ff319400080ca888
1:39:12 PM: deployId: 67bd94a7ff319400080ca88a
1:39:12 PM: packagePath: packages/docs
1:39:12 PM:
1:39:12 PM: ❯ Current directory
1:39:12 PM: /opt/build/repo
1:39:12 PM:
1:39:12 PM: ❯ Config file
1:39:12 PM: /opt/build/repo/packages/docs/netlify.toml
1:39:12 PM:
1:39:12 PM: ❯ Context
1:39:12 PM: deploy-preview
1:39:12 PM:
1:39:12 PM: ❯ Installing plugins
1:39:12 PM: - @netlify/plugin-lighthouse@6.0.1
1:39:22 PM:
1:39:22 PM: ❯ Loading plugins
1:39:22 PM: - @netlify/plugin-lighthouse@6.0.1 from Netlify app
1:39:24 PM:
1:39:24 PM: build.command from netlify.toml
1:39:24 PM: ────────────────────────────────────────────────────────────────
1:39:24 PM: ​
1:39:24 PM: $ yarn build:docs:ci
1:39:24 PM: yarn run v1.22.19
1:39:24 PM: $ yarn workspace @vuestic/formkit build && yarn workspace docs build:ci
1:39:24 PM: $ tsup src/index.ts --format esm --dts --external vuestic-ui
1:39:25 PM: CLI Building entry: src/index.ts
1:39:25 PM: CLI Using tsconfig: tsconfig.json
1:39:25 PM: CLI tsup v6.7.0
1:39:25 PM: CLI Target: es2022
1:39:25 PM: ESM Build start
1:39:25 PM: ESM dist/index.js 26.22 KB
1:39:25 PM: ESM ⚡️ Build success in 26ms
1:39:25 PM: DTS Build start
1:39:27 PM: DTS ⚡️ Build success in 1706ms
1:39:27 PM: DTS dist/index.d.ts 2.98 KB
1:39:27 PM: $ yarn build:analysis && nuxt generate
1:39:27 PM: $ yarn workspace sandbox build:analysis ../docs/page-config/getting-started/tree-shaking
1:39:28 PM: $ node ./scripts/stud-nuxt.mjs && tsx ./scripts/bundle-analysis.ts ../docs/page-config/getting-started/tree-shaking
1:39:28 PM: [bundle analysis] Vuestic dist wasn't found in ../ui/dist. Proceeding new build...
Executing yarn workspace vuestic-ui build
1:39:57 PM: Success yarn workspace vuestic-ui build exited with code 0
1:39:57 PM: Executing vite build --config ./configs/vite/vite.empty.ts
1:39:57 PM: Executing vite build --config ./configs/vite/vite.button.ts
1:39:57 PM: Executing vite build --config ./configs/vite/vite.full.ts
1:39:57 PM: Executing vite build --config ./configs/vite/vite.button-select.ts
1:39:58 PM: Success Empty config was built.
1:39:59 PM: Success Config with button was built.
1:40:00 PM: Success Config with button and select was built.
1:40:00 PM: Success Full config was built.
1:40:00 PM: [bundle analysis] Result was successfully written to ../docs/page-config/getting-started/tree-shaking/tree-shaking.md.
1:40:00 PM: [log] Nuxt 3.14.159 with Nitro 2.10.4
1:40:01 PM: [info] Using Nitro server preset: `static`
1:40:07 PM: [info] [nuxt:tailwindcss] Using Tailwind CSS from ~/assets/css/tailwind.css
1:40:08 PM: [info] Building client...
1:40:08 PM: [info] vite v5.4.11 building for production...
1:40:08 PM: [info] transforming...
1:40:15 PM: [info] 987 modules transformed.
1:40:15 PM: [error] x Build failed in 6.95s
1:40:15 PM: [error] Nuxt Build Error: [vuestic:page-config:compiler] Error transforming page-config: /opt/build/repo/packages/docs/page-config/introduction/change-log/index.ts
1:40:15 PM: Error transforming block: changeLog
1:40:15 PM: Cannot read properties of undefined (reading 'split')
1:40:15 PM: file: /opt/build/repo/packages/docs/page-config/introduction/change-log/index.ts
1:40:15 PM: Error transforming block: changeLog
1:40:15 PM: Cannot read properties of undefined (reading 'split')
1:40:15 PM: file: page-config/introduction/change-log/index.ts
1:40:15 PM: at Object.transform (modules/page-config/composables/useCompiler.ts:31:15)
1:40:15 PM: at async transform (/opt/build/repo/node_modules/vite/node_modules/rollup/dist/es/shared/node-entry.js:20050:16)
1:40:15 PM: at async ModuleLoader.addModuleSource (/opt/build/repo/node_modules/vite/node_modules/rollup/dist/es/shared/node-entry.js:20266:36)
1:40:15 PM: error Command failed with exit code 1. (https://ntl.fyi/exit-code-1)
1:40:15 PM: info Visit https://yarnpkg.com/en/docs/cli/run for documentation about this command.
1:40:15 PM: error Command failed.
1:40:15 PM: Exit code: 1
1:40:15 PM: Command: /opt/buildhome/.nvm/versions/node/v18.20.2/bin/node
1:40:15 PM: Arguments: /opt/buildhome/.cache/node/corepack/v1/yarn/1.22.19/lib/cli.js build:ci
1:40:15 PM: Directory: /opt/build/repo/packages/docs
1:40:15 PM: Output:
1:40:15 PM: info Visit https://yarnpkg.com/en/docs/cli/workspace for documentation about this command.
1:40:15 PM: error Command failed with exit code 1. (https://ntl.fyi/exit-code-1)
1:40:15 PM: info Visit https://yarnpkg.com/en/docs/cli/run for documentation about this command.
1:40:16 PM:
1:40:16 PM: "build.command" failed
1:40:16 PM: ────────────────────────────────────────────────────────────────
1:40:16 PM: ​
1:40:16 PM: Error message
1:40:16 PM: Command failed with exit code 1: yarn build:docs:ci (https://ntl.fyi/exit-code-1)
1:40:16 PM: ​
1:40:16 PM: Error location
1:40:16 PM: In build.command from netlify.toml:
1:40:16 PM: yarn build:docs:ci
1:40:16 PM: ​
1:40:16 PM: Resolved config
1:40:16 PM: build:
1:40:16 PM: command: yarn build:docs:ci
1:40:16 PM: commandOrigin: config
1:40:16 PM: environment:
1:40:16 PM: - GTM_ENABLED
1:40:16 PM: - GTM_ID
1:40:16 PM: - HOSTNAME
1:40:16 PM: - RECAPTCHA_SITE_KEY
1:40:16 PM: - REVIEW_ID
1:40:16 PM: - STORYBOOK_HOSTNAME
1:40:16 PM: - VITE_STORYBOOK_HOSTNAME
1:40:16 PM: publish: /opt/build/repo/packages/docs/dist
1:40:16 PM: publishOrigin: config
1:40:16 PM: plugins:
1:40:16 PM: - inputs: {}
1:40:16 PM: origin: ui
1:40:16 PM: package: '@netlify/plugin-lighthouse'
1:40:17 PM: Failed during stage 'building site': Build script returned non-zero exit code: 2 (https://ntl.fyi/exit-code-2)
1:40:17 PM: Build failed due to a user error: Build script returned non-zero exit code: 2
1:40:17 PM: Failing build: Failed to build site
1:40:17 PM: Finished processing build request in 2m34.97s

Deploying

Skipped
There is no log for this section

Cleanup

Skipped
There is no log for this section

Post-processing

Skipped
There is no log for this section